m-nitrosotoluene
- Formula: C7H7NO
- Molecular weight: 121.1366
- IUPAC Standard InChIKey: UTYPDIZEMVOOJA-UHFFFAOYSA-N
- CAS Registry Number: 620-26-8
- Chemical structure:
View 3d structure (requires JavaScript / HTML 5) - Other names: 3-nitrosotoluene

Reaction thermochemistry data

Data compiled by: John E. Bartmess
Individual Reactions
C7H6NO- + =
By formula: C7H6NO- + H+ = C7H7NO
Quantity | Value | Units | Method | Reference | Comment |
---|---|---|---|---|---|
ΔrH° | 1539. ± 8.8 | kJ/mol | G+TS | Taft and Topsom, 1987 | gas phase |
Quantity | Value | Units | Method | Reference | Comment |
ΔrG° | 1511. ± 8.4 | kJ/mol | IMRE | Taft and Topsom, 1987 | gas phase |

Gas phase ion energetics data

Data compiled by: John E. Bartmess
De-protonation reactions
C7H6NO- + =
By formula: C7H6NO- + H+ = C7H7NO
Quantity | Value | Units | Method | Reference | Comment |
---|---|---|---|---|---|
ΔrH° | 1539. ± 8.8 | kJ/mol | G+TS | Taft and Topsom, 1987 | gas phase |
Quantity | Value | Units | Method | Reference | Comment |
ΔrG° | 1511. ± 8.4 | kJ/mol | IMRE | Taft and Topsom, 1987 | gas phase |

References

Taft and Topsom, 1987
Taft, R.W.; Topsom, R.D.,
The Nature and Analysis of Substituent Effects,
Prog. Phys. Org. Chem., 1987, 16, 1. [all data]