Nonadecane, 1-chloro-
- Formula: C19H39Cl
- Molecular weight: 302.966
- IUPAC Standard InChIKey: ZPHKHTAJPZOPHM-UHFFFAOYSA-N
- CAS Registry Number: 62016-76-6
- Chemical structure:

Phase change data

Data compiled by: William E. Acree, Jr., James S. Chickos
Quantity | Value | Units | Method | Reference | Comment |
---|---|---|---|---|---|
ΔvapH° | 27.41 | kcal/mol | N/A | Bolotnikov and Neruchev, 2006 |
Enthalpy of vaporization
ΔvapH (kcal/mol) | Temperature (K) | Method | Reference | Comment |
---|---|---|---|---|
18.2 | 498. | A | Stephenson and Malanowski, 1987 | Based on data from 483. to 673. K. See also Dykyj and Vanko, 1970. |

Lee's RI, non-polar column, custom temperature program

Column type | Active phase | I | Reference | Comment |
---|---|---|---|---|
Capillary | DB-5 | 360.9 | Fuentes, Font, et al., 2007 | Column length: 60. m; Program: not specified |

References

Bolotnikov and Neruchev, 2006
Bolotnikov, M.F.; Neruchev, Yu.A.,
The enthalpies of vaporization and intermolecular interaction energies of 1-chloroalkanes,
Russ. J. Phys. Chem., 2006, 80, 8, 1191-1197, https://doi.org/10.1134/S0036024406080024
. [all data]
Stephenson and Malanowski, 1987
Stephenson, Richard M.; Malanowski, Stanislaw,
Handbook of the Thermodynamics of Organic Compounds, 1987, https://doi.org/10.1007/978-94-009-3173-2
. [all data]
Dykyj and Vanko, 1970
Dykyj, J.; Vanko, A.,
Petrochemica, 1970, 10, 1, 3. [all data]
Fuentes, Font, et al., 2007
Fuentes, M.J.; Font, R.; Gomez-Rico, M.F.; Martin-Gullon, I.,
Pyrolysis and combustion of waste lubricant oil from diesel cars: Decomposition and pollutants,
J. Anal. Appl. Pyrolysis, 2007, 79, 1-2, 215-226, https://doi.org/10.1016/j.jaap.2006.12.004
. [all data]