Butane, 1-methoxy-2-methyl-
- Formula: C6H14O
- Molecular weight: 102.1748
- IUPAC Standard InChIKey: XGLHRCWEOMNVKS-UHFFFAOYSA-N
- CAS Registry Number: 62016-48-2
- Chemical structure:

Reaction thermochemistry data

Data compiled by: Hussein Y. Afeefy, Joel F. Liebman, and Stephen E. Stein
Individual Reactions
By formula: C5H10 + CH4O = C6H14O
Quantity | Value | Units | Method | Reference | Comment |
---|---|---|---|---|---|
ΔrH° | -35.8 ± 1.3 | kJ/mol | Eqk | Serda, Izquierdo, et al., 1995 | liquid phase |
By formula: C5H10 + CH4O = C6H14O
Quantity | Value | Units | Method | Reference | Comment |
---|---|---|---|---|---|
ΔrH° | -32.8 ± 1.4 | kJ/mol | Eqk | Serda, Izquierdo, et al., 1995 | liquid phase |

Normal alkane RI, non-polar column, temperature ramp

Column type | Active phase | I | Reference | Comment |
---|---|---|---|---|
Capillary | HP-5 | 683. | Larsen and Frisvad, 1995 | 35. C @ 2. min, 6. K/min; Tend: 200. C |

References

Serda, Izquierdo, et al., 1995
Serda, J.A.; Izquierdo, J.F.; Tejero, J.; Cunill, F.; Iborra, M.,
Equilibrium and thermodynamics for 2-methyl-2-methoxybutane liquid-phase decomposition,
Thermochim. Acta, 1995, 259, 111-120. [all data]
Larsen and Frisvad, 1995
Larsen, T.O.; Frisvad, J.C.,
Characterization of volatile metabolites from 47 Penicillium taxa,
Mycol. Res., 1995, 99, 10, 1153-1166, https://doi.org/10.1016/S0953-7562(09)80271-2
. [all data]