Octane, 2,4,6-trimethyl-
- Formula: C11H24
- Molecular weight: 156.3083
- IUPAC Standard InChIKey: XHNIFDXYGLPJLP-UHFFFAOYSA-N
- CAS Registry Number: 62016-37-9
- Chemical structure:

Normal alkane RI, non-polar column, temperature ramp

Column type | Active phase | I | Reference | Comment |
---|---|---|---|---|
Capillary | BP-1 | 955. | Hayes R.A., Richardson B.J., et al., 2002 | 25. m/0.2 mm/0.1 μm, He, 40. C @ 5. min, 8. K/min; Tend: 250. C |

Normal alkane RI, polar column, custom temperature program

Column type | Active phase | I | Reference | Comment |
---|---|---|---|---|
Capillary | Supelcowax-10 | 1058. | Kourkoutas, Bosnea, et al., 2006 | 60. m/0.32 mm/0.25 μm, He; Program: 35C(3min) => 5C/min => 110C => 10C/min => 240C (10min) |

Phase change data

Data compiled by: William E. Acree, Jr., James S. Chickos

Enthalpy of vaporization

ΔvapH (kJ/mol) Temperature (K) Method Reference Comment
44.9340.AStephenson and Malanowski, 1987Based on data from 325. - 442. K.

References

Hayes R.A., Richardson B.J., et al., 2002
Hayes R.A.; Richardson B.J.; Claus S.C.; Wyllie S.G.,
Semiochemicals and social signaling in the wild European rabbit in Australia: II. Variations in chemical composition of chin gland secretion across sampling sites,
J. Chem. Ecol., 2002, 28, 12, 2613-2625, https://doi.org/10.1023/A:1021452623055
. [all data]
Kourkoutas, Bosnea, et al., 2006
Kourkoutas, Y.; Bosnea, L.; Taboukos, S.; Baras, C.; Lambrou, D.; Kanellaki, M.,
Probiotic Cheese Production Using Lactobacillus casei Cells Immobilized on Fruit Pieces,
J. Dairy Sci., 2006, 89, 5, 1439-1451, https://doi.org/10.3168/jds.S0022-0302(06)72212-3
. [all data]