Glycerol-2-nitrate
- Formula: C3H7NO5
- Molecular weight: 137.0914
- IUPAC Standard InChIKey: QYZBMMOLPVKAPU-UHFFFAOYSA-N
- CAS Registry Number: 620-12-2
- Chemical structure:
View 3d structure (requires JavaScript / HTML 5) - Permanent link for this species. Use this link for bookmarking this species for future reference.

Condensed phase thermochemistry data

Data compiled by: Hussein Y. Afeefy, Joel F. Liebman, and Stephen E. Stein
Quantity | Value | Units | Method | Reference | Comment |
---|---|---|---|---|---|
ΔfH°liquid | -568. ± 4. | kJ/mol | Eqk | Kazakov, Kirpichev, et al., 1990 | Heat of nitration |

Reaction thermochemistry data

Data compiled by: Hussein Y. Afeefy, Joel F. Liebman, and Stephen E. Stein
Individual Reactions
By formula: C3H7NO5 + HNO3 = C3H6N2O7 + H2O
Quantity | Value | Units | Method | Reference | Comment |
---|---|---|---|---|---|
ΔrH° | -15. ± 3. | kJ/mol | Eqk | Kazakov, Kirpichev, et al., 1990 | liquid phase; Heat of nitration |
By formula: C3H8O3 + HNO3 = C3H7NO5 + H2O
Quantity | Value | Units | Method | Reference | Comment |
---|---|---|---|---|---|
ΔrH° | -10. ± 3. | kJ/mol | Eqk | Kazakov, Kirpichev, et al., 1990 | liquid phase; Heat of nitration |

References

Kazakov, Kirpichev, et al., 1990
Kazakov, A.I.; Kirpichev, E.P.; Lagodzinskaya, G.V.; Andrienko, L.P.; Yunda, N.G.; Korolev, A.M.; Rubstov, Yu.I.; Manelis, G.B.; Eremenko, L.T.,
Study of nitration equilibrium in the glycerin-aqueous nitric acid system. 2. Changes in ΔH and ΔS in the nitration reaction,
Bull. Acad. Sci. USSR, Div. Chem. Sci., 1990, 1565-1570. [all data]