5-Methyl-1-hexyn-3-ol
- Formula: C7H12O
- Molecular weight: 112.1696
- IUPAC Standard InChIKey: NTNUBJHPRAMQPC-UHFFFAOYSA-N
- CAS Registry Number: 61996-79-0
- Chemical structure:
View 3d structure (requires JavaScript / HTML 5) - Permanent link for this species. Use this link for bookmarking this species for future reference.

Phase change data

Data compiled by: Robert L. Brown and Stephen E. Stein
Quantity | Value | Units | Method | Reference | Comment |
---|---|---|---|---|---|
Tboil | 427. | K | N/A | Farchan Laboratories, 1990 |

References

Farchan Laboratories, 1990
Farchan Laboratories,
Research Chemicals Catalog, Farchan Laboratories, Gainesville, FL, 1990, 91. [all data]