Benzoic acid, 4-ethoxy-
- Formula: C9H10O3
- Molecular weight: 166.1739
- IUPAC Standard InChIKey: SHSGDXCJYVZFTP-UHFFFAOYSA-N
- CAS Registry Number: 619-86-3
- Chemical structure:
View 3d structure (requires JavaScript / HTML 5) - Other names: Benzoic acid, p-ethoxy-; p-Ethoxybenzoic acid; 4-Ethoxybenzoic acid; para-Ethoxybenzoic acid

Phase change data

Data compiled as indicated in comments:
TRC - Thermodynamics Research Center, NIST Boulder Laboratories, Chris Muzny director
AC - William E. Acree, Jr., James S. Chickos
Quantity | Value | Units | Method | Reference | Comment |
---|---|---|---|---|---|
Tfus | 472.8 | K | N/A | Armstrong, James, et al., 1979 | Uncertainty assigned by TRC = 0.5 K; TRC |
Quantity | Value | Units | Method | Reference | Comment |
ΔsubH° | 29.5 ± 0.2 | kcal/mol | N/A | Ribeiro da Silva, Lobo Ferreira, et al., 2010 | AC |
Enthalpy of fusion
ΔfusH (kcal/mol) | Temperature (K) | Reference | Comment |
---|---|---|---|
7.03 | 472.8 | Acree, 1991 | AC |

References

Armstrong, James, et al., 1979
Armstrong, N.A.; James, K.C.; Wong, C.K.,
Inter-relationships between solubilities, distribution coefficients and melting points of some substituted benzoic and phenylacetic acids,
J. Pharm. Pharmacol., 1979, 31, 1, 627, https://doi.org/10.1111/j.2042-7158.1979.tb13606.x
. [all data]
Ribeiro da Silva, Lobo Ferreira, et al., 2010
Ribeiro da Silva, Manuel A.V.; Lobo Ferreira, Ana I.M.C.; Maciel, Fabrice M.,
Experimental standard molar enthalpies of formation of some 4-alkoxybenzoic acids,
The Journal of Chemical Thermodynamics, 2010, 42, 2, 220-224, https://doi.org/10.1016/j.jct.2009.08.007
. [all data]
Acree, 1991
Acree, William E.,
Thermodynamic properties of organic compounds: enthalpy of fusion and melting point temperature compilation,
Thermochimica Acta, 1991, 189, 1, 37-56, https://doi.org/10.1016/0040-6031(91)87098-H
. [all data]