1-Chloro-1-methylcyclopentane
- Formula: C6H11Cl
- Molecular weight: 118.605
- IUPAC Standard InChIKey: XDULUGNXCNQBNS-UHFFFAOYSA-N
- CAS Registry Number: 6196-85-6
- Chemical structure:
View 3d structure (requires JavaScript / HTML 5) - Species with the same structure:

Condensed phase thermochemistry data

Data compiled by: Hussein Y. Afeefy, Joel F. Liebman, and Stephen E. Stein
Quantity | Value | Units | Method | Reference | Comment |
---|---|---|---|---|---|
ΔfH°liquid | -198. ± 2. | kJ/mol | Cm | Arnett and Pienta, 1980 | Hydrochlorination |

Phase change data

Data compiled by: William E. Acree, Jr., James S. Chickos
Enthalpy of vaporization
ΔvapH (kJ/mol) | Temperature (K) | Method | Reference |
---|---|---|---|
39.7 ± 0.1 | 297. | C | Blokhin, Kabo, et al., 1997 |

Reaction thermochemistry data

Data compiled by: Hussein Y. Afeefy, Joel F. Liebman, and Stephen E. Stein
Individual Reactions
By formula: C6H10 + HCl = C6H11Cl
Quantity | Value | Units | Method | Reference | Comment |
---|---|---|---|---|---|
ΔrH° | -54.1 ± 1.6 | kJ/mol | Cm | Arnett and Pienta, 1980 | liquid phase; solvent: Methylene chloride; Hydrochlorination |

References

Arnett and Pienta, 1980
Arnett, E.M.; Pienta, N.J.,
Stabilities of carbonium ions in solution. 12. Heats of formation of alkyl chlorides as an entree to heats of solvation of aliphatic carbonium ions,
J. Am. Chem. Soc., 1980, 102, 3329-3334. [all data]
Blokhin, Kabo, et al., 1997
Blokhin, A.V.; Kabo, G.J.; Kozyro, A.A.; Ivashkevich, L.S.; Krasulin, A.P.; Diky, V.V.; Maksimuk, Yu.V.,
Thermodynamic properties of 1-methylcyclopentanol and 1-chloro-1-methylcyclopentane in the ideal gas state,
Thermochim. Acta, 1997, 292, 19-29. [all data]