Benzoic acid, 4-formyl-
- Formula: C8H6O3
- Molecular weight: 150.1314
- IUPAC Standard InChIKey: GOUHYARYYWKXHS-UHFFFAOYSA-N
- CAS Registry Number: 619-66-9
- Chemical structure:
View 3d structure (requires JavaScript / HTML 5) - Other names: Terephthalaldehydic acid; p-Carboxybenzaldehyde; p-Formylbenzoic acid; 4-Carboxybenzaldehyde; 4-Formylbenzoic acid; Terephthaldehydic acid

Phase change data

Data compiled by: William E. Acree, Jr., James S. Chickos
Enthalpy of fusion
ΔfusH (kJ/mol) | Temperature (K) | Reference |
---|---|---|
21.3 | 452.2 | Chen and Ma, 2004 |

Reaction thermochemistry data

Data compiled by: John E. Bartmess
Individual Reactions
C8H5O3- + =
By formula: C8H5O3- + H+ = C8H6O3
Quantity | Value | Units | Method | Reference | Comment |
---|---|---|---|---|---|
ΔrH° | 1392. ± 8.8 | kJ/mol | G+TS | Taft and Topsom, 1987 | gas phase; value altered from reference due to change in acidity scale |
Quantity | Value | Units | Method | Reference | Comment |
ΔrG° | 1363. ± 8.4 | kJ/mol | IMRE | Taft and Topsom, 1987 | gas phase; value altered from reference due to change in acidity scale |

Gas phase ion energetics data

Data compiled by: John E. Bartmess
De-protonation reactions
C8H5O3- + =
By formula: C8H5O3- + H+ = C8H6O3
Quantity | Value | Units | Method | Reference | Comment |
---|---|---|---|---|---|
ΔrH° | 1392. ± 8.8 | kJ/mol | G+TS | Taft and Topsom, 1987 | gas phase; value altered from reference due to change in acidity scale |
Quantity | Value | Units | Method | Reference | Comment |
ΔrG° | 1363. ± 8.4 | kJ/mol | IMRE | Taft and Topsom, 1987 | gas phase; value altered from reference due to change in acidity scale |

References

Chen and Ma, 2004
Chen, Mingming; Ma, Peisheng,
Solid-Liquid Equilibria of Several Systems Containing Acetic Acid,
J. Chem. Eng. Data, 2004, 49, 4, 756-759, https://doi.org/10.1021/je034114c
. [all data]
Taft and Topsom, 1987
Taft, R.W.; Topsom, R.D.,
The Nature and Analysis of Substituent Effects,
Prog. Phys. Org. Chem., 1987, 16, 1. [all data]