1-Pentene, 3-ethyl-3-methyl-
- Formula: C8H16
- Molecular weight: 112.2126
- IUPAC Standard InChIKey: PHHHEKOJKDYRIN-UHFFFAOYSA-N
- CAS Registry Number: 6196-60-7
- Chemical structure:
View 3d structure (requires JavaScript / HTML 5) - Other names: 3-Ethyl-3-methyl-1-pentene; 3-Ethyl-3-methylpent-1-ene

Phase change data

Data compiled as indicated in comments:
TRC - Thermodynamics Research Center, NIST Boulder Laboratories, Chris Muzny director
AC - William E. Acree, Jr., James S. Chickos
Quantity | Value | Units | Method | Reference | Comment |
---|---|---|---|---|---|
Tboil | 383.7 | K | N/A | Mavity, 1931 | Uncertainty assigned by TRC = 1. K; TRC |
Quantity | Value | Units | Method | Reference | Comment |
ΔvapH° | 38.9 | kJ/mol | N/A | Reid, 1972 | AC |

Kovats' RI, non-polar column, isothermal

View large format table.

Column type Active phase Temperature (C) I Reference Comment
CapillaryPetrocol DH30.744.3Soják, Addová, et al., 2004150. m/0.25 mm/1. μm, H2
CapillarySqualane30.740.1Soják, Addová, et al., 2004He; Column length: 93. m; Column diameter: 0.25 mm
CapillarySqualane40.744.Matukuma, 1969N2; Column length: 91.4 m; Column diameter: 0.25 mm

References

Mavity, 1931
Mavity, J.M.,
, Ph.D. Thesis, Ohio State Univ., Columbus, OH, 1931. [all data]
Reid, 1972
Reid, Robert C.,
Handbook on vapor pressure and heats of vaporization of hydrocarbons and related compounds, R. C. Wilhort and B. J. Zwolinski, Texas A Research Foundation. College Station, Texas(1971). 329 pages.$10.00,
AIChE J., 1972, 18, 6, 1278-1278, https://doi.org/10.1002/aic.690180637
. [all data]