Cyclohexene, 4-methyl-1-(1-methylethyl)-, (R)-
- Formula: C10H18
- Molecular weight: 138.2499
- IUPAC Standard InChIKey: YYCPSEFQLGXPCO-SECBINFHSA-N
- CAS Registry Number: 619-52-3
- Chemical structure:
View 3d structure (requires JavaScript / HTML 5) - Stereoisomers:
- Other names: p-Menth-3-ene, (R)-(+)-; (+)-3-Menthene; 1-Isopropyl-4-methyl-1-cyclohexene, (R)-

Phase change data

Data compiled by: Thermodynamics Research Center, NIST Boulder Laboratories, Chris Muzny director
Quantity | Value | Units | Method | Reference | Comment |
---|---|---|---|---|---|
Tboil | 441.2 | K | N/A | Smith, Fuzek, et al., 1949 | Uncertainty assigned by TRC = 0.5 K |

References

Smith, Fuzek, et al., 1949
Smith, H.A.; Fuzek, J.F.; Meriwether, H.T.,
The Catalytic Hydrogenation of Terpenes,
J. Am. Chem. Soc., 1949, 71, 3765. [all data]