Benzenemethanol, 3-nitro-
- Formula: C7H7NO3
- Molecular weight: 153.1354
- IUPAC Standard InChIKey: CWNPOQFCIIFQDM-UHFFFAOYSA-N
- CAS Registry Number: 619-25-0
- Chemical structure:
View 3d structure (requires JavaScript / HTML 5) - Other names: Benzyl alcohol, m-nitro-; m-Nitrobenzyl alcohol; 3-Nitrobenzyl alcohol; (3-Nitrophenyl) methanol

Phase change data

Data compiled by: Robert L. Brown and Stephen E. Stein
Reduced pressure boiling point
Tboil (K) | Pressure (bar) | Reference |
---|---|---|
450.7 | 0.004 | Weast and Grasselli, 1989 |

Van Den Dool and Kratz RI, non-polar column, temperature ramp

Column type | Active phase | I | Reference | Comment |
---|---|---|---|---|
Capillary | VF-5MS | 1545. | Todua, 2011 | 30. m/0.25 mm/0.25 μm, He; Tstart: 60. C; Tend: 270. C |

References

Weast and Grasselli, 1989
CRC Handbook of Data on Organic Compounds, 2nd Editon, Weast,R.C and Grasselli, J.G., ed(s)., CRC Press, Inc., Boca Raton, FL, 1989, 1. [all data]
Todua, 2011
Todua, N.G.,
Retention Data. NIST Mass Spectrometry Data Center., NIST Mass Spectrometry Data Center, 2011. [all data]