CAS Reg. No. 61923-51-1
- CAS Registry Number: 61923-51-1

Reaction thermochemistry data

Data compiled by: John E. Bartmess
Individual Reactions
(CAS Reg. No. 61923-51-1 • 4294967295) +
= CAS Reg. No. 61923-51-1
By formula: (CAS Reg. No. 61923-51-1 • 4294967295CHF) + CHF = CAS Reg. No. 61923-51-1
Quantity | Value | Units | Method | Reference | Comment |
---|---|---|---|---|---|
ΔrH° | 21.6 ± 3.7 | kcal/mol | N/A | Poutsma, Paulino, et al., 1997 | gas phase; Relative to MeOH at ΔGacid=375.1 |
ΔrH° | 22.7 ± 2.2 | kcal/mol | CIDT | Poutsma, Paulino, et al., 1997 | gas phase |

References

Poutsma, Paulino, et al., 1997
Poutsma, J.C.; Paulino, J.A.; Squires, R.R.,
Absolute Heats of Formation of CHCl, CHF, and CClF. A Gas-Phase Experimental and G2 Theoretical Study.,
J. Phys. Chem. A, 1997, 101, 29, 5327, https://doi.org/10.1021/jp970778f
. [all data]