Benzene, methyl-, difluoro-
- Formula: C7H6F2
- Molecular weight: 128.1193
- IUPAC Standard InChIKey: JDZLOJYSBBLXQD-UHFFFAOYSA-N
- CAS Registry Number: 61906-43-2
- Chemical structure:
View 3d structure (requires JavaScript / HTML 5) - Permanent link for this species. Use this link for bookmarking this species for future reference.

Condensed phase thermochemistry data

Data compiled by: Hussein Y. Afeefy, Joel F. Liebman, and Stephen E. Stein
Quantity | Value | Units | Method | Reference | Comment |
---|---|---|---|---|---|
ΔcH°liquid | -3585. | kJ/mol | Ccb | Swarts, 1919 | Not corrected for CODATA value of ΔfH |

References

Swarts, 1919
Swarts, F.,
Etudes thermochimiques sur les combinaisons organiques fluorees,
J. Chim. Phys., 1919, 17, 3-70. [all data]