Benzoic acid, 3,4-dimethyl-
- Formula: C9H10O2
- Molecular weight: 150.1745
- IUPAC Standard InChIKey: OPVAJFQBSDUNQA-UHFFFAOYSA-N
- CAS Registry Number: 619-04-5
- Chemical structure:
View 3d structure (requires JavaScript / HTML 5) - Other names: 1-Carboxy-3,4-dimethylbenzene; 3,4-Dimethylbenzoic acid

Gas phase thermochemistry data

Data compiled as indicated in comments:
ALS - Hussein Y. Afeefy, Joel F. Liebman, and Stephen E. Stein
DRB - Donald R. Burgess, Jr.
Quantity | Value | Units | Method | Reference | Comment |
---|---|---|---|---|---|
ΔfH°gas | -362.4 ± 1.7 | kJ/mol | Ccb | Colomina, Jimenez, et al., 1984 | see Colomina, Perez-Ossorio, et al., 1961 and Colomina, Perez Ossorio, et al., 1959; ALS |
ΔfH°gas | -362.4 | kJ/mol | N/A | Corral, 1960 | Value computed using ΔfHsolid° value of -468.8±1.3 kj/mol from Corral, 1960 and ΔsubH° value of 106.4 kj/mol from Colomina, Jimenez, et al., 1984.; DRB |

Condensed phase thermochemistry data

Data compiled as indicated in comments:
ALS - Hussein Y. Afeefy, Joel F. Liebman, and Stephen E. Stein
DH - Eugene S. Domalski and Elizabeth D. Hearing
Quantity | Value | Units | Method | Reference | Comment |
---|---|---|---|---|---|
ΔfH°solid | -468.8 ± 1.9 | kJ/mol | Ccb | Colomina, Jimenez, et al., 1984 | see Colomina, Perez-Ossorio, et al., 1961 and Colomina, Perez Ossorio, et al., 1959; ALS |
ΔfH°solid | -468.8 ± 1.3 | kJ/mol | Ccb | Corral, 1960 | Different experiments; ALS |
Quantity | Value | Units | Method | Reference | Comment |
ΔcH°solid | -4501.9 ± 0.5 | kJ/mol | Ccb | Colomina, Jimenez, et al., 1984 | see Colomina, Perez-Ossorio, et al., 1961 and Colomina, Perez Ossorio, et al., 1959; Corresponding ΔfHºsolid = -468.81 kJ/mol (simple calculation by NIST; no Washburn corrections); ALS |
ΔcH°solid | -4502.0 ± 1.0 | kJ/mol | Ccb | Corral, 1960 | Different experiments; Corresponding ΔfHºsolid = -468.73 kJ/mol (simple calculation by NIST; no Washburn corrections); ALS |
Constant pressure heat capacity of solid
Cp,solid (J/mol*K) | Temperature (K) | Reference | Comment |
---|---|---|---|
199.7 | 299.65 | Colomina, Jimenez, et al., 1984 | DH |

Phase change data

Data compiled as indicated in comments:
TRC - Thermodynamics Research Center, NIST Boulder Laboratories, Chris Muzny director
ALS - Hussein Y. Afeefy, Joel F. Liebman, and Stephen E. Stein
DRB - Donald R. Burgess, Jr.
Quantity | Value | Units | Method | Reference | Comment |
---|---|---|---|---|---|
Tfus | 437. | K | N/A | Birch, Dean, et al., 1949 | Uncertainty assigned by TRC = 3. K; TRC |
Tfus | 435.65 | K | N/A | Marvel, Saunders, et al., 1946 | Uncertainty assigned by TRC = 2. K; TRC |
Quantity | Value | Units | Method | Reference | Comment |
ΔsubH° | 106.4 ± 0.3 | kJ/mol | V | Colomina, Jimenez, et al., 1984 | see Colomina, Perez-Ossorio, et al., 1961 and Colomina, Perez Ossorio, et al., 1959; ALS |
ΔsubH° | 106.4 | kJ/mol | N/A | Colomina, Jimenez, et al., 1984 | DRB |

Reaction thermochemistry data

Data compiled by: John E. Bartmess
Individual Reactions
C9H9O2- + =
By formula: C9H9O2- + H+ = C9H10O2
Quantity | Value | Units | Method | Reference | Comment |
---|---|---|---|---|---|
ΔrG° | 1398. ± 8.4 | kJ/mol | IMRE | Decouzon, Exner, et al., 1996 | gas phase |

Gas phase ion energetics data

Data compiled by: John E. Bartmess
De-protonation reactions
C9H9O2- + =
By formula: C9H9O2- + H+ = C9H10O2
Quantity | Value | Units | Method | Reference | Comment |
---|---|---|---|---|---|
ΔrG° | 1398. ± 8.4 | kJ/mol | IMRE | Decouzon, Exner, et al., 1996 | gas phase |

Normal alkane RI, non-polar column, temperature ramp

Column type | Active phase | I | Reference | Comment |
---|---|---|---|---|
Capillary | Ultra-1 | 1387. | Okumura, 1991 | 25. m/0.32 mm/0.25 μm, He, 3. K/min; Tstart: 80. C; Tend: 260. C |

Normal alkane RI, polar column, custom temperature program

Column type | Active phase | I | Reference | Comment |
---|---|---|---|---|
Capillary | DB-Wax | 2447. | Mayorga, Knapp, et al., 2001 | 30. m/0.25 mm/0.25 μm; Program: 50C(4min) => 4C/min => 130C => 1C/min => 190C => 4C/min => 220C(20min) |

References

Colomina, Jimenez, et al., 1984
Colomina, M.; Jimenez, P.; Roux, M.V.; Turrion, C.,
Thermochemical properties of benzoic acid derivatives. XI. Vapour pressures and enthalpies of sublimation and formation of the six dimethylbenzoic acids,
J. Chem. Thermodyn., 1984, 16, 1121-1127. [all data]
Colomina, Perez-Ossorio, et al., 1961
Colomina, M.; Perez-Ossorio, R.; Boned, M.L.; Panea, M.; Turrion, C.,
Investigaciones termoquimicas sobre los acidos alquilbenzoicos. II. Acidos dimetrilbenzoicos,
Anal. Fisc. Quim. B, 1961, 57, 665-672. [all data]
Colomina, Perez Ossorio, et al., 1959
Colomina, M.; Perez Ossorio, R.; Boned, M.L.; Panea, M.; Turrion, C.,
Thermochemical investigations on methylsubstituted benzoic acids, Rpt. for the U.S. Dept. of the Army, European Research Office contract no. DA-91-508-EUC-358 by Instituto de Quimica Fisica Madrid, Spain, 1959, 1-36. [all data]
Corral, 1960
Corral, L.B.,
Investigaciones termoquimicas sobre los acidos toluicos y dimetilbenzoicos,
Rev. R. Acad. Cienc., 1960, 54, 365-403. [all data]
Birch, Dean, et al., 1949
Birch, S.F.; Dean, R.A.; Fidler, F.A.; Lowry, R.A.,
The preparation of the c(10) monocyclic aromatic hydrocarbons,
J. Am. Chem. Soc., 1949, 71, 1362. [all data]
Marvel, Saunders, et al., 1946
Marvel, C.S.; Saunders, J.H.; Overberger, C.G.,
J. Am. Chem. Soc., 1946, 68, 1085. [all data]
Decouzon, Exner, et al., 1996
Decouzon, M.; Exner, O.; Gal, J.-F.; Maria, P.-C.,
Non-classical Buttressing Effect: Gas-phase Ionization of Some Methyl Substituted Benzoic Acids,
J. Chem. Soc. Perkin Trans., 1996, 2, 4, 475, https://doi.org/10.1039/p29960000475
. [all data]
Maschka and Trauer, 1953
Maschka, A.; Trauer, W.,
Monatsh. Chem., 1953, 84, 1071. [all data]
Okumura, 1991
Okumura, T.,
retention indices of environmental chemicals on methyl silicone capillary column,
Journal of Environmental Chemistry (Japan), 1991, 1, 2, 333-358, https://doi.org/10.5985/jec.1.333
. [all data]
Mayorga, Knapp, et al., 2001
Mayorga, H.; Knapp, H.; Winterhalter, P.; Duque, C.,
Glycosidically bound flavor compounds of cape gooseberry (Physalis peruviana L.),
J. Agric. Food Chem., 2001, 49, 4, 1904-1908, https://doi.org/10.1021/jf0011743
. [all data]