Cyclohexanol, 2-methyl-5-(1-methylethenyl)-
- Formula: C10H18O
- Molecular weight: 154.2493
- IUPAC Standard InChIKey: KRCZYMFUWVJCLI-UHFFFAOYSA-N
- CAS Registry Number: 619-01-2
- Chemical structure:
- Stereoisomers:
- Other names: p-Menth-8-en-2-ol; 1,6-Dihydrocarveol; 6-Methyl-3-isopropenylcyclohexanol; 8-p-Menthen-2-ol; 2-Methyl-5-(1-methylethenyl)cyclohexanol; Dihydrocarveol; Dihydrocarveol (Isomer 1); Dihydrocarveol (Isomer 2); 5-Isopropenyl-2-methylcyclohexanol; Dihydrocarveol (Isomer 3)

Phase change data

Data compiled as indicated in comments:
BS - Robert L. Brown and Stephen E. Stein
AC - William E. Acree, Jr., James S. Chickos
Quantity | Value | Units | Method | Reference | Comment |
---|---|---|---|---|---|
Tboil | 497.7 | K | N/A | Aldrich Chemical Company Inc., 1990 | BS |
Enthalpy of vaporization
ΔvapH (kJ/mol) | Temperature (K) | Method | Reference | Comment |
---|---|---|---|---|
58.2 | 351. | A | Stephenson and Malanowski, 1987 | Based on data from 336. to 498. K.; AC |

Van Den Dool and Kratz RI, non-polar column, custom temperature program

Column type | Active phase | I | Reference | Comment |
---|---|---|---|---|
Capillary | 5 % Phenyl methyl siloxane | 1194. | Sacchetti, Maietti, et al., 2005 | 30. m/0.32 mm/0.15 μm, He; Program: 45C => 1C/min => 100C => 5C/min => 250C (10min) |

Normal alkane RI, non-polar column, temperature ramp

Column type | Active phase | I | Reference | Comment |
---|---|---|---|---|
Capillary | DB-5 MS | 1202. | Cui, Yang, et al., 2011 | 30. m/0.25 mm/0.25 μm, Helium, 3. K/min; Tstart: 60. C; Tend: 270. C |
Capillary | CP-Sil 5 CB | 1189. | Olawore, Usman, et al., 2006 | 25. m/0.25 mm/0.15 μm, Hydrogen, 3. K/min; Tstart: 50. C; Tend: 230. C |

Normal alkane RI, non-polar column, custom temperature program

Column type | Active phase | I | Reference | Comment |
---|---|---|---|---|
Capillary | 5 % Phenyl polydimethyl siloxane | 1196. | Chaverri, Diaz, et al., 2011 | Program: not specified |
Capillary | ZB-1 MS | 1196. | Al-Reza, Rahman, et al., 2009 | 30. m/0.25 mm/0.25 μm, Helium; Program: 50 0C 3 0C/min -> 150 0C (10 min) 10 0C/min -> 250 0C |
Capillary | HP-5 | 1165. | Zhao, Li, et al., 2008 | 30. m/0.25 mm/0.25 μm; Program: 40 0C (2 min) 5 0C/min -> 80 0C 7 oC/min -> 160 0C 9 0C/min -> 200 0C 20 0C/min -> 280 0C (10 min) |
Capillary | HP-5 | 1195. | Zhao, Li, et al., 2008 | 30. m/0.25 mm/0.25 μm; Program: not specified |
Capillary | SE-52 | 1194. | Tognolini, Barocelli, et al., 2006 | 30. m/0.32 mm/0.15 μm, He; Program: 45C => 1C/min => 100C => 5C/min => 250C (10min) |
Capillary | OV-1, SE-30, Methyl silicone, SP-2100, OV-101, DB-1, etc. | 1208. | Waggott and Davies, 1984 | Hydrogen; Column length: 50. m; Column diameter: 0.32 mm; Program: not specified |

Normal alkane RI, polar column, custom temperature program

Column type | Active phase | I | Reference | Comment |
---|---|---|---|---|
Capillary | DB-Wax | 1709. | Welke, Manfroi, et al., 2012 | 30. m/0.25 mm/0.25 μm, Helium; Program: not specified |
Capillary | DB-Wax | 1720. | Welke, Manfroi, et al., 2012 | 30. m/0.25 mm/0.25 μm, Helium; Program: not specified |
Capillary | HP Innowax | 1720. | Laribi, Kouki, et al., 2011 | 30. m/0.25 mm/0.25 μm, Nitrogen; Program: 35 0C (10 min) 3 0C/min -> 205 0C 10 0C/min -> 225 0C |

References

Aldrich Chemical Company Inc., 1990
Aldrich Chemical Company Inc.,
Catalog Handbook of Fine Chemicals, Aldrich Chemical Company, Inc., Milwaukee WI, 1990, 1. [all data]
Stephenson and Malanowski, 1987
Stephenson, Richard M.; Malanowski, Stanislaw,
Handbook of the Thermodynamics of Organic Compounds, 1987, https://doi.org/10.1007/978-94-009-3173-2
. [all data]
Sacchetti, Maietti, et al., 2005
Sacchetti, G.; Maietti, S.; Muzzoli, M.; Scaglianti, M.; Manfredini, S.; Radice, M.; Bruni, R.,
Comparative evaluation of 11 essential oils of different origin as functional antioxidants, antiradicals and antimicrobials in foods,
Food Chem., 2005, 91, 4, 621-632, https://doi.org/10.1016/j.foodchem.2004.06.031
. [all data]
Cui, Yang, et al., 2011
Cui, J.; Yang, X.; Dong, A.-J.; Cheng, D.-Y.; Wang, J.; Zhao, H.-T.; Xu, R.-B.; Wang, P.; Li, W.-J.,
Chemical composition and antioxidant activity of Wuphorbia fischeriana essential oil from China,
J. Med. Plants Res., 2011, 5, 19, 4894-4798. [all data]
Olawore, Usman, et al., 2006
Olawore, N.O.; Usman, L.A.; Ogunwande, I.A.; Adeleke, K.A.,
Constituents of rhizome essential oils of two types of Cyperus articulatus L. grown in Nigeria,
J. Essent Oil Res., 2006, 18, 6, 604-606, https://doi.org/10.1080/10412905.2006.9699179
. [all data]
Chaverri, Diaz, et al., 2011
Chaverri, C.; Diaz, C.; Cicco, J.F.,
Chemical analysis of essential oils from Ocotea gomezii W.C. Burger and Ocotea morae Gomez-Laur. (Lauraceae) collected at Reserva biologica Alberto M. Brenes in Costa Rica and their cytotoxic activity on Tumor cell lines,
J. Braz. Chem. Soc., 2011, 22, 4, s1-s4, https://doi.org/10.1590/S0103-50532011000400018
. [all data]
Al-Reza, Rahman, et al., 2009
Al-Reza, S.M.; Rahman, A.; Kang, S.C.,
Chemical composition and inhibitory effect of essentiasl oil and organic extracts of Cestrum nocturnum L. om food-borne pathogens,
Int. J. Food Sci. Technol., 2009, 44, 6, 1176-1182, https://doi.org/10.1111/j.1365-2621.2009.01939.x
. [all data]
Zhao, Li, et al., 2008
Zhao, Y.; Li, J.; Xu, Y.; Duan, H.; Fan, W.; Zhao, G.,
EXtraction, preparation and identification of volatile compounds in Changyu XO brandy,
Chinese J. Chromatogr., 2008, 26, 2, 212-222, https://doi.org/10.1016/S1872-2059(08)60014-0
. [all data]
Tognolini, Barocelli, et al., 2006
Tognolini, M.; Barocelli, E.; Ballabeni, V.; Bruni, R.; Bianchi, A.; Chiavarini, M.; Impicciatore, M.,
Comparative screening of plant essential oils: Phenylpropanoid moiety as basic core for antiplatelet activity,
Life Sciences, 2006, 78, 13, 1419-1432, https://doi.org/10.1016/j.lfs.2005.07.020
. [all data]
Waggott and Davies, 1984
Waggott, A.; Davies, I.W.,
Identification of organic pollutants using linear temperature programmed retention indices (LTPRIs) - Part II, 1984, retrieved from http://dwi.defra.gov.uk/research/completed-research/reports/dwi0383.pdf. [all data]
Welke, Manfroi, et al., 2012
Welke, J.E.; Manfroi, V.; Zanus, M.; Lazarotto, M.; Zini, C.A.,
Characterization of the volatile profile of Brazilian merlot wines through comprehensive two dimensional gas chromatography time-of-flight mass spectrometric detection,
J. Chromatogr. A, 2012, 1226, 124-139, https://doi.org/10.1016/j.chroma.2012.01.002
. [all data]
Laribi, Kouki, et al., 2011
Laribi, B.; Kouki, K.; Sahli, A.; Mougou, A.; Marzouk, B.,
Essential oil fatty acids composition of a Tunisian caraway (Carum carvi L.) seed ecotype cultivated under water deficit,
Adv. Environ. Biol., 2011, 1-15, retrieved from http://www.thefreelibrary.com//print/PrintArticle.aspx?id=253057768. [all data]