3-(1,1-dimethylethyl)cyclopentene
- Formula: C9H16
- Molecular weight: 124.2233
- IUPAC Standard InChIKey: YERUCTDRLXMVDT-UHFFFAOYSA-N
- CAS Registry Number: 6189-88-4
- Chemical structure:
View 3d structure (requires JavaScript / HTML 5) - Permanent link for this species. Use this link for bookmarking this species for future reference.

Phase change data

Data compiled by: Thermodynamics Research Center, NIST Boulder Laboratories, Chris Muzny director
Quantity | Value | Units | Method | Reference | Comment |
---|---|---|---|---|---|
Tboil | 412.3 | K | N/A | Crane, Boord, et al., 1945 | Uncertainty assigned by TRC = 1.5 K |

References

Crane, Boord, et al., 1945
Crane, G.; Boord, C.E.; Henne, A.L.,
The Preparation of Cyclopentenes and Cyclopentanes I.,
J. Am. Chem. Soc., 1945, 67, 1237. [all data]