Benzoic acid, 3-iodo-, methyl ester
- Formula: C8H7IO2
- Molecular weight: 262.0445
- IUPAC Standard InChIKey: NPXOIGSBRLCOSD-UHFFFAOYSA-N
- CAS Registry Number: 618-91-7
- Chemical structure:
View 3d structure (requires JavaScript / HTML 5) - Other names: Benzoic acid, m-iodo-, methyl ester; Methyl m-iodobenzoate; Methyl 3-iodobenzoate; 3-Iodomethylbenzoate

Condensed phase thermochemistry data

Data compiled by: Hussein Y. Afeefy, Joel F. Liebman, and Stephen E. Stein
Quantity | Value | Units | Method | Reference | Comment |
---|---|---|---|---|---|
ΔcH°solid | -3870.2 ± 4.2 | kJ/mol | Ccb | Smith, 1956 | Reanalyzed by Cox and Pilcher, 1970, Original value = -3869. ± 3. kJ/mol |

Phase change data

Data compiled by: Robert L. Brown and Stephen E. Stein
Reduced pressure boiling point
Tboil (K) | Pressure (bar) | Reference |
---|---|---|
549.7 | 0.985 | Weast and Grasselli, 1989 |
423.2 | 0.024 | Weast and Grasselli, 1989 |

Van Den Dool and Kratz RI, non-polar column, temperature ramp

Column type | Active phase | I | Reference | Comment |
---|---|---|---|---|
Packed | SE-30 | 1448. | Peng, Ding, et al., 1988 | He, Supelcoport and Chromosorb, 40. C @ 4. min, 10. K/min, 250. C @ 60. min; Column length: 3.05 m |

Van Den Dool and Kratz RI, non-polar column, custom temperature program

Column type | Active phase | I | Reference | Comment |
---|---|---|---|---|
Packed | SE-30 | 1448. | Peng, Ding, et al., 1988 | Supelcoport; Chromosorb; Column length: 3.05 m; Program: 40C(5min) => 10C/min => 200C or 250C (60min) |

References

Smith, 1956
Smith, L.,
Corrected heats of combustion of organic iodine compounds,
Acta Chem. Scand., 1956, 10, 884-886. [all data]
Cox and Pilcher, 1970
Cox, J.D.; Pilcher, G.,
Thermochemistry of Organic and Organometallic Compounds, Academic Press, New York, 1970, 1-636. [all data]
Weast and Grasselli, 1989
CRC Handbook of Data on Organic Compounds, 2nd Editon, Weast,R.C and Grasselli, J.G., ed(s)., CRC Press, Inc., Boca Raton, FL, 1989, 1. [all data]
Peng, Ding, et al., 1988
Peng, C.T.; Ding, S.F.; Hua, R.L.; Yang, Z.C.,
Prediction of Retention Indexes I. Structure-Retention Index Relationship on Apolar Columns,
J. Chromatogr., 1988, 436, 137-172, https://doi.org/10.1016/S0021-9673(00)94575-8
. [all data]