Benzenamine, 3,5-dinitro-
- Formula: C6H5N3O4
- Molecular weight: 183.1216
- IUPAC Standard InChIKey: MPBZUKLDHPOCLS-UHFFFAOYSA-N
- CAS Registry Number: 618-87-1
- Chemical structure:
View 3d structure (requires JavaScript / HTML 5) - Other names: Aniline, 3,5-dinitro-; 3,5-Dinitroaniline; Benzeneamine, 3,5-dinitro-

Condensed phase thermochemistry data

Data compiled by: Hussein Y. Afeefy, Joel F. Liebman, and Stephen E. Stein
Quantity | Value | Units | Method | Reference | Comment |
---|---|---|---|---|---|
ΔfH°solid | -39. | kJ/mol | Ccb | Macharacek, Zacharov, et al., 1962 | |
Quantity | Value | Units | Method | Reference | Comment |
ΔcH°solid | -3037. | kJ/mol | Ccb | Macharacek, Zacharov, et al., 1962 |

Lee's RI, non-polar column, temperature ramp

Column type | Active phase | I | Reference | Comment |
---|---|---|---|---|
Capillary | DB-5MS | 321.42 | Chen, Keeran, et al., 2002 | 30. m/0.25 mm/0.5 μm, 40. C @ 1. min, 10. K/min; Tend: 310. C |

References

Macharacek, Zacharov, et al., 1962
Macharacek, K.; Zacharov, A.I.; Aljosina, L.A.,
Spalna a slucovaci tepla izomernich dinitroanilinu,
Chem. Prumsyl., 1962, 12, 23-24. [all data]
Chen, Keeran, et al., 2002
Chen, P.H.; Keeran, W.S.; Van Ausdale, W.A.; Schindler, D.R.; Roberts, D.W.,
Application of Lee retention indices to the confirmation of tentatively identified compounds from GC/MS analysis of environmental samples, Technical paper, Analytical Services Division, Environmental ScienceEngineering, Inc, PO Box 1703, Gainesville, FL 32602, 2002, 11. [all data]