Benzene, 1-methyl-3,5-dinitro-
- Formula: C7H6N2O4
- Molecular weight: 182.1335
- IUPAC Standard InChIKey: RUIFULUFLANOCI-UHFFFAOYSA-N
- CAS Registry Number: 618-85-9
- Chemical structure:

Condensed phase thermochemistry data

Data compiled by: Hussein Y. Afeefy, Joel F. Liebman, and Stephen E. Stein
Quantity | Value | Units | Method | Reference | Comment |
---|---|---|---|---|---|
ΔcH°solid | -853.0 | kcal/mol | Ccb | Garner and Abernethy, 1921 |

Phase change data

Data compiled as indicated in comments:
AC - William E. Acree, Jr., James S. Chickos
Enthalpy of vaporization
ΔvapH (kcal/mol) | Temperature (K) | Method | Reference | Comment |
---|---|---|---|---|
15.0 | 508. | A | Stephenson and Malanowski, 1987 | Based on data from 493. to 543. K. See also Maksimov, 1968.; AC |
Antoine Equation Parameters
log10(P) = A − (B / (T + C))
P = vapor pressure (atm)
T = temperature (K)
View plot Requires a JavaScript / HTML 5 canvas capable browser.
Temperature (K) | A | B | C | Reference | Comment |
---|---|---|---|---|---|
493. to 543. | 3.89330 | 1765.196 | -137.706 | Maksimov, 1968, 2 | Coefficents calculated by NIST from author's data. |

References

Garner and Abernethy, 1921
Garner, W.E.; Abernethy, C.L.,
Heats of combustion and formation of nitro-compounds. Part I. - Benzene, toluene, phenol and methylaniline series,
Proc. Roy. Soc. London A, 1921, 213-235. [all data]
Stephenson and Malanowski, 1987
Stephenson, Richard M.; Malanowski, Stanislaw,
Handbook of the Thermodynamics of Organic Compounds, 1987, https://doi.org/10.1007/978-94-009-3173-2
. [all data]
Maksimov, 1968
Maksimov, Y.Y.,
Russ. J. Phys. Chem., 1968, 42, 11, 1550. [all data]
Maksimov, 1968, 2
Maksimov, Yu,
Steam Pressures of Nitroaromatic Compouds at Different Temperatures,
Zh. Fiz. Khim., 1968, 42, 2921-2925. [all data]