Paroxetine
- Formula: C19H20FNO3
- Molecular weight: 329.3654
- IUPAC Standard InChIKey: AHOUBRCZNHFOSL-UHFFFAOYSA-N
- CAS Registry Number: 61869-08-7
- Chemical structure:
View 3d structure (requires JavaScript / HTML 5) - Other names: Piperidine, 3-[(1,3-benzodioxol-5-yloxy)methyl]-4-(4-fluorophenyl)-, (3S-trans)-; (-)-(3S,4R)-4-(p-Fluorophenyl)-3-[((3,4-methylenedioxy)phenoxy]methyl]piperidine; Aropax; BRL-29060; FG-7051; Paxil; 3-[(1,3-Benzodioxol-5-yloxy)methyl]-4-(4-fluorophenyl)piperidine, (-)-(3S,4R)-; Casbol; Frosinor; Motivan; Paxetil; PaxPar; Piperidine, 3-((1,3-benzodioxol-5-yloxy)methyl)-4-(4-fluorophenyl)-, (3S,4R)-; Paroxetine hydrochloride; Seroxat; 63952-24-9

Van Den Dool and Kratz RI, non-polar column, temperature ramp

Column type | Active phase | I | Reference | Comment |
---|---|---|---|---|
Capillary | VF-5MS | 2673.5 | Tretyakov, 2014 | 30. m/0.25 mm/0.25 μm, He; Tstart: 60. C; Tend: 270. C |

References

Tretyakov, 2014
Tretyakov, K.V.,
Retention Data. NIST Mass Spectrometry Data Center., NIST Mass Spectrometry Data Center, 2014. [all data]