hexane, 3-ethyl-2,2,3-trimethyl-

Phase change data

Data compiled by: Thermodynamics Research Center, NIST Boulder Laboratories, Chris Muzny director

Quantity Value Units Method Reference Comment
Tfus163.KN/APetrov, 1955Uncertainty assigned by TRC = 5. K

In addition to the Thermodynamics Research Center (TRC) data available from this site, much more physical and chemical property data is available from the following TRC products:

References

Petrov, 1955
Petrov, A.D., Synthesis of Branched Aliphatic Hydrocarbons from β-Alkenyl Halides, Izv. Akad. Nauk SSSR, 1955, 1955, 639-48. [all data]