Heptadecane, 2,3-dimethyl-
- Formula: C19H40
- Molecular weight: 268.5209
- IUPAC Standard InChIKey: LNMKTLJTVALPBD-UHFFFAOYSA-N
- CAS Registry Number: 61868-03-9
- Chemical structure:
View 3d structure (requires JavaScript / HTML 5) - Other names: 5-Methyloctadecane

Phase change data

Data compiled by: William E. Acree, Jr., James S. Chickos
Enthalpy of vaporization
ΔvapH (kJ/mol) | Temperature (K) | Method | Reference | Comment |
---|---|---|---|---|
64.1 | 462. | N/A | Dykyj, Svoboda, et al., 1999 | Based on data from 447. to 598. K. See also Terres, Brinkmann, et al., 1959. |
67.2 | 508. | A | Stephenson and Malanowski, 1987 | Based on data from 493. to 598. K. |

References

Dykyj, Svoboda, et al., 1999
Dykyj, J.; Svoboda, J.; Wilhoit, R.C.; Frenkel, M.L.; Hall, K.R.,
Vapor Pressure of Chemicals: Part A. Vapor Pressure and Antoine Constants for Hydrocarbons and Sulfur, Selenium, Tellurium and Hydrogen Containing Organic Compounds, Springer, Berlin, 1999, 373. [all data]
Terres, Brinkmann, et al., 1959
Terres, E.; Brinkmann, L.; Fischer, D.; Hüllstrung, D.; Loz, W.; Weisbrod, G.,
Brennst.-Chem., 1959, 40, 279. [all data]
Stephenson and Malanowski, 1987
Stephenson, Richard M.; Malanowski, Stanislaw,
Handbook of the Thermodynamics of Organic Compounds, 1987, https://doi.org/10.1007/978-94-009-3173-2
. [all data]