3,5-Dichloronitrobenzene
- Formula: C6H3Cl2NO2
- Molecular weight: 192.000
- IUPAC Standard InChIKey: RNABGKOKSBUFHW-UHFFFAOYSA-N
- CAS Registry Number: 618-62-2
- Chemical structure:
View 3d structure (requires JavaScript / HTML 5) - Other names: Benzene, 1,3-dichloro-5-nitro-; m-Dichloronitrobenzene; meta-Dichloronitrobenzene; 1,3-Dichloro-5-nitrobenzene; 3,5-Dichloro-1-nitrobenzene

Phase change data

Data compiled as indicated in comments:
TRC - Thermodynamics Research Center, NIST Boulder Laboratories, Chris Muzny director
AC - William E. Acree, Jr., James S. Chickos
Quantity | Value | Units | Method | Reference | Comment |
---|---|---|---|---|---|
Tfus | 338. | K | N/A | Buechner, 1906 | Uncertainty assigned by TRC = 2. K; TRC |
Quantity | Value | Units | Method | Reference | Comment |
ΔsubH° | 83.2 ± 1.5 | kJ/mol | C | Ribeiro da Silva, Lobo Ferreira, et al., 2009 | AC |

Gas phase ion energetics data

Data compiled by: John E. Bartmess
Electron affinity determinations
EA (eV) | Method | Reference | Comment |
---|---|---|---|
1.548 ± 0.087 | IMRE | Huh, Kang, et al., 1999 | ΔG(EA) 343K; anchored to ΔG value. Including anchor ΔS, EA is ca. 0.4 kcal/mol more bound. |
1.500 ± 0.087 | IMRE | Mishima, Huh, et al., 1993 | ΔGea(343 K)=-35.2 kcal/mol. Reanchored to EA(PhNO2), Kebarle and Chowdhury, 1987. |

Normal alkane RI, non-polar column, custom temperature program

Column type | Active phase | I | Reference | Comment |
---|---|---|---|---|
Capillary | OV-1, SE-30, Methyl silicone, SP-2100, OV-101, DB-1, etc. | 1288. | Waggott and Davies, 1984 | Hydrogen; Column length: 50. m; Column diameter: 0.32 mm; Program: not specified |

Normal alkane RI, polar column, custom temperature program

Column type | Active phase | I | Reference | Comment |
---|---|---|---|---|
Capillary | Carbowax 400, Carbowax 20M, Carbowax 1540, Carbowax 4000, Superox 06, PEG 20M, etc. | 1887. | Waggott and Davies, 1984 | Hydrogen; Column length: 50. m; Column diameter: 0.32 mm; Program: not specified |

References

Buechner, 1906
Buechner, E.H.,
Z. Phys. Chem., Stoechiom. Verwandtschaftsl., 1906, 54, 665. [all data]
Ribeiro da Silva, Lobo Ferreira, et al., 2009
Ribeiro da Silva, Manuel A.V.; Lobo Ferreira, Ana I.M.C.; Moreno, Ana Rita G.,
Experimental and computational thermochemical study of the dichloronitrobenzene isomers,
The Journal of Chemical Thermodynamics, 2009, 41, 8, 904-910, https://doi.org/10.1016/j.jct.2009.03.001
. [all data]
Huh, Kang, et al., 1999
Huh, C.; Kang, C.H.; Lee, H.W.; Nakamura, H.; Mishima, M.; Tsuno, Y.; Yamataka, H.,
Thermodynamic stabilities and resonance demand of aromatic radical anions in the gas phase,
Bull. Chem. Soc. Japan, 1999, 72, 5, 1083-1091, https://doi.org/10.1246/bcsj.72.1083
. [all data]
Mishima, Huh, et al., 1993
Mishima, M.; Huh, C.; Nakamura, H.; Fujio, M.; Tsuno, Y.,
Electron Affinities of Benzaldehydes. Substituent Effects on Stabilities of Aromatic Radical Anions.,
Tetrahed. Lett., 1993, 34, 26, 4223, https://doi.org/10.1016/S0040-4039(00)60533-6
. [all data]
Kebarle and Chowdhury, 1987
Kebarle, P.; Chowdhury, S.,
Electron affinities and electron transfer reactions,
Chem. Rev., 1987, 87, 513. [all data]
Shorygin and Egorova, 1958
Shorygin, P.P.; Egorova, Z.S.,
Dependence of indications of conjugation on the angle of rotation of metoxyl and dimethylamin groups relative to the plane of a benzene ring,
Dokl. Akad. Nauk SSSR, 1958, 121, 5, 869-872. [all data]
Waggott and Davies, 1984
Waggott, A.; Davies, I.W.,
Identification of organic pollutants using linear temperature programmed retention indices (LTPRIs) - Part II, 1984, retrieved from http://dwi.defra.gov.uk/research/completed-research/reports/dwi0383.pdf. [all data]