Furan, 2,3-dihydro-4-methoxy-
- Formula: C5H8O2
- Molecular weight: 100.1158
- IUPAC Standard InChIKey: XWASILHMSZZXHI-UHFFFAOYSA-N
- CAS Registry Number: 61860-75-1
- Chemical structure:
View 3d structure (requires JavaScript / HTML 5) - Permanent link for this species. Use this link for bookmarking this species for future reference.

Reaction thermochemistry data

Data compiled by: Hussein Y. Afeefy, Joel F. Liebman, and Stephen E. Stein
Individual Reactions
By formula: C5H8O2 = C5H8O2
Quantity | Value | Units | Method | Reference | Comment |
---|---|---|---|---|---|
ΔrH° | 1.8 ± 0.1 | kcal/mol | Eqk | Taskinen, 1976 | liquid phase; solvent: Cyclohexane; NMR & or GLC |

References

Taskinen, 1976
Taskinen, E.,
Thermodynamics of vinyl ethers-XVII. Thermodynamic stability of 1,2-dialkoxyethylenes,
Tetrahedron, 1976, 32, 2327-2329. [all data]