Cyclopentane, 1,5-dimethoxy-
- Formula: C7H12O2
- Molecular weight: 128.1690
- IUPAC Standard InChIKey: YLBQPTZQSYROOF-UHFFFAOYSA-N
- CAS Registry Number: 61860-73-9
- Chemical structure:
View 3d structure (requires JavaScript / HTML 5) - Stereoisomers:

Reaction thermochemistry data

Data compiled by: Hussein Y. Afeefy, Joel F. Liebman, and Stephen E. Stein
Individual Reactions
By formula: C7H12O2 = C7H12O2
Quantity | Value | Units | Method | Reference | Comment |
---|---|---|---|---|---|
ΔrH° | -11.9 ± 0.2 | kJ/mol | Eqk | Taskinen, 1976 | liquid phase; solvent: Cyclohexene; NMR & or GLC |

References

Taskinen, 1976
Taskinen, E.,
Thermodynamics of vinyl ethers-XVII. Thermodynamic stability of 1,2-dialkoxyethylenes,
Tetrahedron, 1976, 32, 2327-2329. [all data]