1,2-Dimethoxycyclohexene
- Formula: C8H14O2
- Molecular weight: 142.1956
- IUPAC Standard InChIKey: UFNZEJDITDLQOW-UHFFFAOYSA-N
- CAS Registry Number: 61860-72-8
- Chemical structure:
View 3d structure (requires JavaScript / HTML 5) - Permanent link for this species. Use this link for bookmarking this species for future reference.

Reaction thermochemistry data

Data compiled by: Hussein Y. Afeefy, Joel F. Liebman, and Stephen E. Stein
Individual Reactions
By formula: C8H14O2 = C8H14O2
Quantity | Value | Units | Method | Reference | Comment |
---|---|---|---|---|---|
ΔrH° | -11.4 ± 0.2 | kJ/mol | Eqk | Taskinen, 1976 | liquid phase; solvent: Cyclohexane; NMR & or GLC |

References

Taskinen, 1976
Taskinen, E.,
Thermodynamics of vinyl ethers-XVII. Thermodynamic stability of 1,2-dialkoxyethylenes,
Tetrahedron, 1976, 32, 2327-2329. [all data]