1-Propene, 2,3-dimethoxy-
- Formula: C5H10O2
- Molecular weight: 102.1317
- IUPAC Standard InChIKey: USZQGXVRDYONEE-UHFFFAOYSA-N
- CAS Registry Number: 61860-67-1
- Chemical structure:

Reaction thermochemistry data

Data compiled by: Hussein Y. Afeefy, Joel F. Liebman, and Stephen E. Stein
Individual Reactions
By formula: C5H10O2 = C5H10O2
Quantity | Value | Units | Method | Reference | Comment |
---|---|---|---|---|---|
ΔrH° | -0.6 ± 0.4 | kJ/mol | Eqk | Taskinen, 1976 | liquid phase; solvent: Cyclohexane; NMR & or GLC |

References

Taskinen, 1976
Taskinen, E.,
Thermodynamics of vinyl ethers-XVII. Thermodynamic stability of 1,2-dialkoxyethylenes,
Tetrahedron, 1976, 32, 2327-2329. [all data]