Benzoyl chloride, 3-chloro-
- Formula: C7H4Cl2O
- Molecular weight: 175.012
- IUPAC Standard InChIKey: WHIHIKVIWVIIER-UHFFFAOYSA-N
- CAS Registry Number: 618-46-2
- Chemical structure:
View 3d structure (requires JavaScript / HTML 5) - Other names: Benzoyl chloride, m-chloro-; m-Chlorobenzoyl chloride; 3-Chlorobenzoyl chloride

Condensed phase thermochemistry data

Data compiled by: Hussein Y. Afeefy, Joel F. Liebman, and Stephen E. Stein
Quantity | Value | Units | Method | Reference | Comment |
---|---|---|---|---|---|
ΔfH°liquid | -190.0 ± 1.6 | kJ/mol | Cm | Moselhy and Pritchard, 1975 |

Phase change data

Data compiled as indicated in comments:
BS - Robert L. Brown and Stephen E. Stein
AC - William E. Acree, Jr., James S. Chickos
Quantity | Value | Units | Method | Reference | Comment |
---|---|---|---|---|---|
Tboil | 498.2 | K | N/A | Weast and Grasselli, 1989 | BS |
Enthalpy of vaporization
ΔvapH (kJ/mol) | Temperature (K) | Method | Reference | Comment |
---|---|---|---|---|
49.4 | 382. | A | Stephenson and Malanowski, 1987 | Based on data from 367. to 391. K. See also Dykyj, Svoboda, et al., 1999.; AC |

Reaction thermochemistry data

Data compiled by: Hussein Y. Afeefy, Joel F. Liebman, and Stephen E. Stein
Individual Reactions
By formula: C7H4Cl2O + H2O = C7H5ClO2 + HCl
Quantity | Value | Units | Method | Reference | Comment |
---|---|---|---|---|---|
ΔrH° | -41.1 ± 0.3 | kJ/mol | Cm | Moselhy and Pritchard, 1975 | liquid phase; solvent: Diphenyl-ether |

Van Den Dool and Kratz RI, non-polar column, custom temperature program

Column type | Active phase | I | Reference | Comment |
---|---|---|---|---|
Capillary | VF-5MS | 1246.6 | Tret'yakov, 2007 | 30. m/0.25 mm/0.25 μm, He; Program: Multi-step temperature program; T(initial)=60C; T(final)=270C |

References

Moselhy and Pritchard, 1975
Moselhy, G.M.; Pritchard, H.O.,
The thermochemistry of the chloro-benzoyl chlorides,
J. Chem. Thermodyn., 1975, 7, 977-982. [all data]
Weast and Grasselli, 1989
CRC Handbook of Data on Organic Compounds, 2nd Editon, Weast,R.C and Grasselli, J.G., ed(s)., CRC Press, Inc., Boca Raton, FL, 1989, 1. [all data]
Stephenson and Malanowski, 1987
Stephenson, Richard M.; Malanowski, Stanislaw,
Handbook of the Thermodynamics of Organic Compounds, 1987, https://doi.org/10.1007/978-94-009-3173-2
. [all data]
Dykyj, Svoboda, et al., 1999
Dykyj, J.; Svoboda, J.; Wilhoit, R.C.; Frenkel, M.L.; Hall, K.R.,
Vapor Pressure of Chemicals: Part A. Vapor Pressure and Antoine Constants for Hydrocarbons and Sulfur, Selenium, Tellurium and Hydrogen Containing Organic Compounds, Springer, Berlin, 1999, 373. [all data]
Tret'yakov, 2007
Tret'yakov, K.V.,
Retention Data. NIST Mass Spectrometry Data Center., NIST Mass Spectrometry Data Center, 2007. [all data]