Phenol, 3-(1-methylethyl)-
- Formula: C9H12O
- Molecular weight: 136.1910
- IUPAC Standard InChIKey: VLJSLTNSFSOYQR-UHFFFAOYSA-N
- CAS Registry Number: 618-45-1
- Chemical structure:

Gas phase thermochemistry data

Data compiled by: Hussein Y. Afeefy, Joel F. Liebman, and Stephen E. Stein
Quantity | Value | Units | Method | Reference | Comment |
---|---|---|---|---|---|
ΔfH°gas | -175.3 ± 2.4 | kJ/mol | Eqk | Nesterova, Pimerzin, et al., 1989 | Author was aware that data differs from previously reported values; Isomerization |
ΔfH°gas | -190.6 | kJ/mol | Ccb | Bertholon, Giray, et al., 1971 | see Bertholon, 1967 |

Condensed phase thermochemistry data

Data compiled by: Hussein Y. Afeefy, Joel F. Liebman, and Stephen E. Stein
Quantity | Value | Units | Method | Reference | Comment |
---|---|---|---|---|---|
ΔfH°liquid | -260. | kJ/mol | Ccb | Bertholon, Giray, et al., 1971 | see Bertholon, 1967 |
Quantity | Value | Units | Method | Reference | Comment |
ΔcH°liquid | -4993.6 | kJ/mol | Ccb | Bertholon, Giray, et al., 1971 | see Bertholon, 1967; Corresponding ΔfHºliquid = -263. kJ/mol (simple calculation by NIST; no Washburn corrections) |

Phase change data

Data compiled as indicated in comments:
BS - Robert L. Brown and Stephen E. Stein
TRC - Thermodynamics Research Center, NIST Boulder Laboratories, Chris Muzny director
ALS - Hussein Y. Afeefy, Joel F. Liebman, and Stephen E. Stein
DRB - Donald R. Burgess, Jr.
AC - William E. Acree, Jr., James S. Chickos
Quantity | Value | Units | Method | Reference | Comment |
---|---|---|---|---|---|
Tboil | 500. ± 3. | K | AVG | N/A | Average of 6 values; Individual data points |
Quantity | Value | Units | Method | Reference | Comment |
Tfus | 299.1 ± 0.2 | K | AVG | N/A | Average of 6 values; Individual data points |
Quantity | Value | Units | Method | Reference | Comment |
ΔvapH° | 73.01 | kJ/mol | C | Bertholon, Giray, et al., 1971 | see Bertholon, 1967; ALS |
ΔvapH° | 69.4 | kJ/mol | N/A | Bertholon, Giray, et al., 1971 | DRB |
Enthalpy of vaporization
ΔvapH (kJ/mol) | Temperature (K) | Method | Reference | Comment |
---|---|---|---|---|
64.3 | 392. | A | Stephenson and Malanowski, 1987 | Based on data from 377. to 497. K.; AC |
Antoine Equation Parameters
log10(P) = A − (B / (T + C))
P = vapor pressure (bar)
T = temperature (K)
View plot Requires a JavaScript / HTML 5 canvas capable browser.
Temperature (K) | A | B | C | Reference | Comment |
---|---|---|---|---|---|
335. to 501. | 5.17738 | 2406.573 | -36.231 | Stull, 1947 | Coefficents calculated by NIST from author's data. |

Gas phase ion energetics data

Data compiled by: John E. Bartmess
De-protonation reactions
C9H11O- + =
By formula: C9H11O- + H+ = C9H12O
Quantity | Value | Units | Method | Reference | Comment |
---|---|---|---|---|---|
ΔrH° | 1460. ± 8.8 | kJ/mol | G+TS | Fujio, McIver, et al., 1981 | gas phase; value altered from reference due to change in acidity scale |
Quantity | Value | Units | Method | Reference | Comment |
ΔrG° | 1432. ± 8.4 | kJ/mol | IMRE | Fujio, McIver, et al., 1981 | gas phase; value altered from reference due to change in acidity scale |

Reaction thermochemistry data

Data compiled as indicated in comments:
B - John E. Bartmess
ALS - Hussein Y. Afeefy, Joel F. Liebman, and Stephen E. Stein
Individual Reactions
C9H11O- + =
By formula: C9H11O- + H+ = C9H12O
Quantity | Value | Units | Method | Reference | Comment |
---|---|---|---|---|---|
ΔrH° | 349.0 ± 2.1 | kcal/mol | G+TS | Fujio, McIver, et al., 1981 | gas phase; value altered from reference due to change in acidity scale; B |
Quantity | Value | Units | Method | Reference | Comment |
ΔrG° | 342.2 ± 2.0 | kcal/mol | IMRE | Fujio, McIver, et al., 1981 | gas phase; value altered from reference due to change in acidity scale; B |
By formula: C9H12O = C9H12O
Quantity | Value | Units | Method | Reference | Comment |
---|---|---|---|---|---|
ΔrH° | -0.339 ± 0.069 | kcal/mol | Eqk | Nesterova, Pilyshchikov, et al., 1983 | liquid phase; GC; ALS |

Kovats' RI, non-polar column, isothermal

Column type | Active phase | Temperature (C) | I | Reference | Comment |
---|---|---|---|---|---|
Capillary | PS-255 | 150. | 1207. | Engewald, Billing, et al., 1988 | 50. m/0.30 mm/0.25 μm |

Van Den Dool and Kratz RI, non-polar column, custom temperature program

Column type | Active phase | I | Reference | Comment |
---|---|---|---|---|
Capillary | VF-5MS | 1227.3 | Mjøs, Meier, et al., 2006 | 50. m/0.25 mm/0.25 μm, He; Program: 60C(2min) => 30C/min => 100C => 1C/min => |
Capillary | VF-5MS | 1227.9 | Mjøs, Meier, et al., 2006 | 50. m/0.25 mm/0.25 μm, He; Program: 60C(2min) => 30C/min => 100C => 2C/min => |
Capillary | VF-5MS | 1229.2 | Mjøs, Meier, et al., 2006 | 50. m/0.25 mm/0.25 μm, He; Program: 60C(2min) => 30C/min => 100C => 4C/min => |

Normal alkane RI, non-polar column, custom temperature program

Column type | Active phase | I | Reference | Comment |
---|---|---|---|---|
Capillary | Polydimethyl siloxane, unknown content of Ph-groups | 1228. | Geldon, 1989 | Program: not specified |

References

Nesterova, Pimerzin, et al., 1989
Nesterova, T.N.; Pimerzin, A.A.; Rozhnov, A.M.; Karlina, T.N.,
Equilibria for the isomerization of (secondary-alkyl)phenols and cyclohexylphenols,
J. Chem. Thermodyn., 1989, 21, 385-395. [all data]
Bertholon, Giray, et al., 1971
Bertholon, G.; Giray, M.; Perrin, R.; Vincent-Falquet-Berny, M.F.,
No. 532. - Etude physicochimique des phenols. OX. - Ethanlpies de combustion et energies de resonance des alcoyl et aryphenols,
Bull. Soc. Chim. France, 1971, 3180-3187. [all data]
Bertholon, 1967
Bertholon, G.,
No. 534. - Etude physicochimique des phonols. VI. - Etude physicochimique des trois isopropylphenols isomeres,
Bull. Soc. Chim. France, 1967, 8, 2977-2982. [all data]
Stephenson and Malanowski, 1987
Stephenson, Richard M.; Malanowski, Stanislaw,
Handbook of the Thermodynamics of Organic Compounds, 1987, https://doi.org/10.1007/978-94-009-3173-2
. [all data]
Stull, 1947
Stull, Daniel R.,
Vapor Pressure of Pure Substances. Organic and Inorganic Compounds,
Ind. Eng. Chem., 1947, 39, 4, 517-540, https://doi.org/10.1021/ie50448a022
. [all data]
Fujio, McIver, et al., 1981
Fujio, M.; McIver, R.T., Jr.; Taft, R.W.,
Effects on the acidities of phenols from specific substituent-solvent interactions. Inherent substituent parameters from gas phase acidities,
J. Am. Chem. Soc., 1981, 103, 4017. [all data]