Benzoyl iodide
- Formula: C7H5IO
- Molecular weight: 232.0185
- IUPAC Standard InChIKey: WPCXDBCEDWUSOU-UHFFFAOYSA-N
- CAS Registry Number: 618-38-2
- Chemical structure:
View 3d structure (requires JavaScript / HTML 5) - Permanent link for this species. Use this link for bookmarking this species for future reference.

Gas phase thermochemistry data

Data compiled by: Hussein Y. Afeefy, Joel F. Liebman, and Stephen E. Stein
Quantity | Value | Units | Method | Reference | Comment |
---|---|---|---|---|---|
ΔfH°gas | 11. ± 4.2 | kJ/mol | Eqk | Solly and Benson, 1971 | |
ΔfH°gas | 10. ± 6.3 | kJ/mol | Cm | Carson, Pritchard, et al., 1950 | Heat of formation derived by Cox and Pilcher, 1970 |

Condensed phase thermochemistry data

Data compiled by: Hussein Y. Afeefy, Joel F. Liebman, and Stephen E. Stein
Quantity | Value | Units | Method | Reference | Comment |
---|---|---|---|---|---|
ΔfH°liquid | -51.51 ± 0.42 | kJ/mol | Cm | Carson, Pritchard, et al., 1950 | Reanalyzed by Cox and Pilcher, 1970, Original value = -52.51 kJ/mol; Heat of hydrolysis |

Phase change data

Data compiled as indicated in comments:
BS - Robert L. Brown and Stephen E. Stein
TRC - Thermodynamics Research Center, NIST Boulder Laboratories, Chris Muzny director
ALS - Hussein Y. Afeefy, Joel F. Liebman, and Stephen E. Stein
Quantity | Value | Units | Method | Reference | Comment |
---|---|---|---|---|---|
Tfus | 276. | K | N/A | Buckingham and Donaghy, 1982 | BS |
Tfus | 276. | K | N/A | Kizhner, 1909 | Uncertainty assigned by TRC = 2. K; TRC |
Quantity | Value | Units | Method | Reference | Comment |
ΔvapH° | 61.9 ± 6.3 | kJ/mol | E | Carson, Pritchard, et al., 1950 | Heat of formation derived by Cox and Pilcher, 1970; ALS |
Reduced pressure boiling point
Tboil (K) | Pressure (bar) | Reference | Comment |
---|---|---|---|
401. | 0.027 | Buckingham and Donaghy, 1982 | BS |

Reaction thermochemistry data

Data compiled by: Hussein Y. Afeefy, Joel F. Liebman, and Stephen E. Stein
Individual Reactions
By formula: C7H9NO + C7H5IO = HI + C14H13NO2
Quantity | Value | Units | Method | Reference | Comment |
---|---|---|---|---|---|
ΔrH° | -185. ± 2. | kJ/mol | Cac | Kiselev, Khuzyasheva, et al., 1979 | liquid phase; solvent: Benzene |
By formula: C7H9N + C7H5IO = HI + C14H13NO
Quantity | Value | Units | Method | Reference | Comment |
---|---|---|---|---|---|
ΔrH° | -168. ± 2. | kJ/mol | Cac | Kiselev, Khuzyasheva, et al., 1979 | liquid phase; solvent: Benzene |
By formula: C7H5IO + C6H7N = HI + C13H11NO
Quantity | Value | Units | Method | Reference | Comment |
---|---|---|---|---|---|
ΔrH° | -166. ± 2. | kJ/mol | Cac | Kiselev, Khuzyasheva, et al., 1979 | liquid phase; solvent: Benzene |
By formula: C7H5IO + H2O = HI + C7H6O2
Quantity | Value | Units | Method | Reference | Comment |
---|---|---|---|---|---|
ΔrH° | -102.4 | kJ/mol | Cm | Carson, Pritchard, et al., 1950 | liquid phase; Heat of hydrolysis |
By formula: HI + C7H5IO = C7H6O + I2
Quantity | Value | Units | Method | Reference | Comment |
---|---|---|---|---|---|
ΔrH° | -13. ± 4.2 | kJ/mol | Eqk | Solly and Benson, 1971 | gas phase |
By formula: C7H6O + I2 = HI + C7H5IO
Quantity | Value | Units | Method | Reference | Comment |
---|---|---|---|---|---|
ΔrH° | 13. ± 4.2 | kJ/mol | Eqk | Solly and Benson, 1971 | gas phase |

References

Solly and Benson, 1971
Solly, R.K.; Benson, S.W.,
Thermochemistry of the reaction of benzaldehyde with iodine. The enthalpy of formation of benzaldehyde and benzoyl iodide,
J. Chem. Thermodyn., 1971, 3, 203-209. [all data]
Carson, Pritchard, et al., 1950
Carson, A.S.; Pritchard, H.O.; Skinner, H.A.,
The heats of hydrolysis of the benzoyl halides,
J. Chem. Soc., 1950, 656-659. [all data]
Cox and Pilcher, 1970
Cox, J.D.; Pilcher, G.,
Thermochemistry of Organic and Organometallic Compounds, Academic Press, New York, 1970, 1-636. [all data]
Buckingham and Donaghy, 1982
Buckingham, J.; Donaghy, S.M.,
Dictionary of Organic Compounds: Fifth Edition, Chapman and Hall, New York, 1982, 1. [all data]
Kizhner, 1909
Kizhner, N. (see kishner n),
Benzoyl Iodide and its Relation to Ether,
Zh. Russ. Fiz.-Khim. O-va., Chast Khim., 1909, 41, 651. [all data]
Kiselev, Khuzyasheva, et al., 1979
Kiselev, V.D.; Khuzyasheva, d.G.; Konovalov, A.I.,
Thermochemical study of the acylation of para-substituted anilines,
J. Gen. Chem. USSR, 1979, 49, 2273-2276. [all data]