3-Decen-1-yne, (Z)-
- Formula: C10H16
- Molecular weight: 136.2340
- IUPAC Standard InChIKey: OMLUZGAUTCIZLU-ALCCZGGFSA-N
- CAS Registry Number: 61827-88-1
- Chemical structure:
View 3d structure (requires JavaScript / HTML 5) - Stereoisomers:

Reaction thermochemistry data

Data compiled by: Hussein Y. Afeefy, Joel F. Liebman, and Stephen E. Stein
Individual Reactions
By formula: 3H2 + C10H16 = C10H22
Quantity | Value | Units | Method | Reference | Comment |
---|---|---|---|---|---|
ΔrH° | -400. ± 2. | kJ/mol | Chyd | Skinner and Snelson, 1959 | liquid phase; solvent: Acetic acid |

References

Skinner and Snelson, 1959
Skinner, H.A.; Snelson, A.,
Heats of hydrogenation Part 3.,
Trans. Faraday Soc., 1959, 55, 405-407. [all data]