m-xylene, 4-propyl-
- Formula: C11H16
- Molecular weight: 148.2447
- IUPAC Standard InChIKey: HPAXKQMKDWCLGU-UHFFFAOYSA-N
- CAS Registry Number: 61827-85-8
- Chemical structure:
View 3d structure (requires JavaScript / HTML 5) - Species with the same structure:

Phase change data

Data compiled by: Thermodynamics Research Center, NIST Boulder Laboratories, Chris Muzny director
Quantity | Value | Units | Method | Reference | Comment |
---|---|---|---|---|---|
Tboil | 481.4 | K | N/A | Uhlhorn, 1890 | Uncertainty assigned by TRC = 6. K |

References

Uhlhorn, 1890
Uhlhorn, E.,
Chem. Ber., 1890, 23, 2349. [all data]