Benzyltrichlorogermane
- Formula: C7H7Cl3Ge
- Molecular weight: 270.13
- CAS Registry Number: 6181-21-1

Phase change data

Data compiled by: William E. Acree, Jr., James S. Chickos
Enthalpy of vaporization
ΔvapH (kJ/mol) | Temperature (K) | Reference | Comment |
---|---|---|---|
58.8 | 388. | Sokolov, Karapet'yants, et al., 1972 | Based on data from 373. to 473. K. |

References

Sokolov, Karapet'yants, et al., 1972
Sokolov, V.B.; Karapet'yants, M.Kh.; Kolesnikov, S.P.; Perl'mutter, B.L.; Nefedov, O.M.,
Tr. Mosk. Khim. Tekhnol. Inst., 1972, 71, 6. [all data]