2-ethylbutyronitrile
- Formula: C6H11N
- Molecular weight: 97.1582
- IUPAC Standard InChIKey: QARLTYSAFQGMMB-UHFFFAOYSA-N
- CAS Registry Number: 617-80-1
- Chemical structure:
View 3d structure (requires JavaScript / HTML 5) - Other names: butanenitrile, 2-ethyl-

Phase change data

Data compiled by: Thermodynamics Research Center, NIST Boulder Laboratories, Chris Muzny director
Quantity | Value | Units | Method | Reference | Comment |
---|---|---|---|---|---|
Tboil | 417. ± 2. | K | AVG | N/A | Average of 6 values; Individual data points |

References

No reference data available.