Bismuthine, triethyl-
- Formula: C6H15Bi
- Molecular weight: 296.1637
- IUPAC Standard InChIKey: FPYOWXFLVWSKPS-UHFFFAOYSA-N
- CAS Registry Number: 617-77-6
- Chemical structure:
View 3d structure (requires JavaScript / HTML 5) - Other names: Triethylbismuth; triethylbismuthine

Gas phase thermochemistry data

Data compiled by: José A. Martinho Simões
Quantity | Value | Units | Method | Reference | Comment |
---|---|---|---|---|---|
ΔfH°gas | 216. ± 17. | kJ/mol | Review | Martinho Simões |

Condensed phase thermochemistry data

Data compiled as indicated in comments:
MS - José A. Martinho Simões
DH - Eugene S. Domalski and Elizabeth D. Hearing
Quantity | Value | Units | Method | Reference | Comment |
---|---|---|---|---|---|
ΔfH°liquid | 170. ± 17. | kJ/mol | Review | Martinho Simões | MS |
Quantity | Value | Units | Method | Reference | Comment |
ΔcH°liquid | -4961. ± 17. | kJ/mol | CC-SB | Lautsch, Tröber, et al., 1963 | Please also see Pedley and Rylance, 1977 and Cox and Pilcher, 1970.; MS |
Quantity | Value | Units | Method | Reference | Comment |
S°liquid | 379.0 | J/mol*K | N/A | Nistratov, Rabinovich, et al., 1989 | DH |
Constant pressure heat capacity of liquid
Cp,liquid (J/mol*K) | Temperature (K) | Reference | Comment |
---|---|---|---|
242.2 | 298.15 | Nistratov, Rabinovich, et al., 1989 | T = 5 to 330 K. Cp data also given for the glassy state (0-94.8 K) and the supercooled liquid (94.8-145.8 K). T(glass) = 94.8 K.; DH |

Phase change data

Data compiled as indicated in comments:
TRC - Thermodynamics Research Center, NIST Boulder Laboratories, Chris Muzny director
MS - José A. Martinho Simões
AC - William E. Acree, Jr., James S. Chickos
DH - Eugene S. Domalski and Elizabeth D. Hearing
Quantity | Value | Units | Method | Reference | Comment |
---|---|---|---|---|---|
Ttriple | 145.8 | K | N/A | Nistratov, Rabinovich, et al., 1989, 2 | Uncertainty assigned by TRC = 0.1 K; TRC |
Quantity | Value | Units | Method | Reference | Comment |
ΔvapH° | 46.0 ± 4.2 | kJ/mol | CC-SB | Lautsch, Tröber, et al., 1964 | MS |
Enthalpy of vaporization
ΔvapH (kJ/mol) | Temperature (K) | Reference | Comment |
---|---|---|---|
43.9 | 322. | Maier, Seyferth, et al., 1957 | Based on data from 301. to 343. K.; AC |
Enthalpy of fusion
ΔfusH (kJ/mol) | Temperature (K) | Reference | Comment |
---|---|---|---|
8.695 | 145.80 | Nistratov, Rabinovich, et al., 1989 | DH |
8.7 | 145.8 | Nistratov, Kabinovich, et al., 1989 | AC |
Entropy of fusion
ΔfusS (J/mol*K) | Temperature (K) | Reference | Comment |
---|---|---|---|
59.64 | 145.80 | Nistratov, Rabinovich, et al., 1989 | DH |

References

Martinho Simões
Martinho Simões, J.A.,
Private communication (see http://webbook.nist.gov/chemistry/om/). [all data]
Lautsch, Tröber, et al., 1963
Lautsch, W.F.; Tröber, A.; Zimmer, W.; Mehner, L.; Linck, W.; Lehmann, H.M.; Brandenberger, H.; Korner, H.; Metschker, H.-J.; Wagner, K.; Kaden, R.,
Z. Chem., 1963, 3, 415. [all data]
Pedley and Rylance, 1977
Pedley, J.B.; Rylance, J.,
Computer Analysed Thermochemical Data: Organic and Organometallic Compounds, University of Sussex, Brigton, 1977. [all data]
Cox and Pilcher, 1970
Cox, J.D.; Pilcher, G.,
Thermochemistry of Organic and Organometallic Compounds
in Academic Press, New York, 1970. [all data]
Nistratov, Rabinovich, et al., 1989
Nistratov, V.P.; Rabinovich, I.B.; Sheiman, M.S.; Smirnova, N.N.; Zelyaev, I.A.; Feshchenko, I.A.,
Specific heat and thermodyanamic characteristics of triethylbismuth,
Zhur. Fiz. Khim., 1989, 63, 1779-1783. [all data]
Nistratov, Rabinovich, et al., 1989, 2
Nistratov, V.P.; Rabinovich, I.B.; Sheiman, M.S.; Smirnova, N.N.; Zelyaev, I.A.; Feshchenko, I.A.,
Zh. Fiz. Khim., 1989, 1779. [all data]
Lautsch, Tröber, et al., 1964
Lautsch, W.F.; Tröber, A.; Korner, H.; Wagner, K.; Kaden, R.; Blase, S.,
Z. Chem., 1964, 4, 441. [all data]
Maier, Seyferth, et al., 1957
Maier, Ludwig; Seyferth, Dietmar; Stone, F.G.A.; Rochow, Eugene G.,
Vinyl Derivatives of the Metals. VI. Preparation, Properties and Some Reactions of Trivinyl Compounds of Group V Elements 1,2,
J. Am. Chem. Soc., 1957, 79, 22, 5884-5889, https://doi.org/10.1021/ja01579a012
. [all data]
Nistratov, Kabinovich, et al., 1989
Nistratov, V.P.; Kabinovich, I.B.; Sheiman, M.S.; Smirnova, N.N.; Zelyaev, I.A.; Feshchenko, I.A.,
Heat capacity and thermodynamic characteristics of triethylbismuth,
Zh. Fiz. Khim., 1989, 63, 7, 1779. [all data]