DL-Glutamic acid
- Formula: C5H9NO4
- Molecular weight: 147.1293
- IUPAC Standard InChIKey: WHUUTDBJXJRKMK-UHFFFAOYSA-N
- CAS Registry Number: 617-65-2
- Chemical structure:
- Other names: Glutamic acid, DL-; (.+/-.)-Glutamic acid; Glutamic acid; NSC 9967; Glutamic acid DL-form; 2-Aminopropane-1,3-dicarboxylic acid; DL-glutamic acid monohydrate

Reaction thermochemistry data

Data compiled by: Robert C. Dunbar
Individual Reactions
By formula: Na+ + C5H9NO4 = (Na+ • C5H9NO4)
Quantity | Value | Units | Method | Reference | Comment |
---|---|---|---|---|---|
ΔrH° | 48.7 | kcal/mol | CIDC | Kish, Ohanessian, et al., 2003 | Anchor alanine=39.89 |

Ion clustering data

Data compiled by: Robert C. Dunbar
Clustering reactions
By formula: Na+ + C5H9NO4 = (Na+ • C5H9NO4)
Quantity | Value | Units | Method | Reference | Comment |
---|---|---|---|---|---|
ΔrH° | 48.7 | kcal/mol | CIDC | Kish, Ohanessian, et al., 2003 | Anchor alanine=39.89 |

References

Kish, Ohanessian, et al., 2003
Kish, M.M.; Ohanessian, G.; Wesdemiotis, C.,
The Na+ affinities of a-amino acids: side-chain substituent effects,
Int. J. Mass Spectrom., 2003, 227, 3, 509, https://doi.org/10.1016/S1387-3806(03)00082-4
. [all data]