2-Methyl-but-2-enedioic acid dimethyl ester

Normal alkane RI, non-polar column, temperature ramp

View large format table.

Column type Active phase I Reference Comment
CapillaryOV-1011055.Pinkston, Spiteller, et al., 1981H2, 80. C @ 7. min, 2. K/min; Column length: 30. m; Column diameter: 0.3 mm; Tend: 275. C

References

Pinkston, Spiteller, et al., 1981
Pinkston, D.; Spiteller, G.; von Henning, H.; Matthaei, D., High-resolution gas chromatography-mass spectrometry of the methyl esters of organic acids from uremic hemofiltrates, J. Chromatogr., 1981, 223, 1, 1-19, https://doi.org/10.1016/S0378-4347(00)80063-8 . [all data]