dl-Aspartic acid
- Formula: C4H7NO4
- Molecular weight: 133.1027
- IUPAC Standard InChIKey: CKLJMWTZIZZHCS-UHFFFAOYSA-N
- CAS Registry Number: 617-45-8
- Chemical structure:
- Other names: Aspartic acid, dl-; DL-Asparagic acid; Aspartic acid; acid D,L-aspart

Reaction thermochemistry data

Data compiled by: Robert C. Dunbar
Individual Reactions
By formula: Na+ + C4H7NO4 = (Na+ • C4H7NO4)
Quantity | Value | Units | Method | Reference | Comment |
---|---|---|---|---|---|
ΔrH° | 48.5 | kcal/mol | CIDC | Kish, Ohanessian, et al., 2003 | Anchor alanine=39.89 |

Ion clustering data

Data compiled by: Robert C. Dunbar
Clustering reactions
By formula: Na+ + C4H7NO4 = (Na+ • C4H7NO4)
Quantity | Value | Units | Method | Reference | Comment |
---|---|---|---|---|---|
ΔrH° | 48.5 | kcal/mol | CIDC | Kish, Ohanessian, et al., 2003 | Anchor alanine=39.89 |

References

Kish, Ohanessian, et al., 2003
Kish, M.M.; Ohanessian, G.; Wesdemiotis, C.,
The Na+ affinities of a-amino acids: side-chain substituent effects,
Int. J. Mass Spectrom., 2003, 227, 3, 509, https://doi.org/10.1016/S1387-3806(03)00082-4
. [all data]