3-Hexanol, 2-methyl-
- Formula: C7H16O
- Molecular weight: 116.2013
- IUPAC Standard InChIKey: RGRUUTLDBCWYBL-UHFFFAOYSA-N
- CAS Registry Number: 617-29-8
- Chemical structure:
View 3d structure (requires JavaScript / HTML 5) - Stereoisomers:
- Other names: 1-Isopropyl-1-butanol; 2-Methyl-3-hexanol; 5-Methyl-4-hexanol; 2-Methylhexan-3-ol

Phase change data

Data compiled as indicated in comments:
TRC - Thermodynamics Research Center, NIST Boulder Laboratories, Chris Muzny director
BS - Robert L. Brown and Stephen E. Stein
AC - William E. Acree, Jr., James S. Chickos
Quantity | Value | Units | Method | Reference | Comment |
---|---|---|---|---|---|
Tboil | 418. ± 9. | K | AVG | N/A | Average of 6 values; Individual data points |
Reduced pressure boiling point
Tboil (K) | Pressure (bar) | Reference | Comment |
---|---|---|---|
415.2 | 1.02 | Aldrich Chemical Company Inc., 1990 | BS |
Enthalpy of vaporization
ΔvapH (kJ/mol) | Temperature (K) | Reference | Comment |
---|---|---|---|
55.7 | 338. | Wilhoit and Zwolinski, 1973 | Based on data from 323. to 420. K.; AC |

Kovats' RI, non-polar column, isothermal

Data compiled by: NIST Mass Spectrometry Data Center, William E. Wallace, director

Column type PackedPackedPacked
Active phase SE-30SE-30SE-30
Column length (m) 1.1.1.
Carrier gas ArArAr
Substrate Chromosorb W AW DMCS HP (80-100 mesh)Chromosorb W AW DMCS HP (80-100 mesh)Chromosorb W AW DMCS HP (80-100 mesh)
Column diameter (mm)
Phase thickness (μm)
Temperature (C) 100.120.140.
I 858.852.854.
ReferencePías and Gascó, 1975Pías and Gascó, 1975Pías and Gascó, 1975
Comment MSDC-RI MSDC-RI MSDC-RI

References

Aldrich Chemical Company Inc., 1990
Aldrich Chemical Company Inc.,
Catalog Handbook of Fine Chemicals, Aldrich Chemical Company, Inc., Milwaukee WI, 1990, 1. [all data]
Wilhoit and Zwolinski, 1973
Wilhoit, R.C.; Zwolinski, B.J.,
Physical and thermodynamic properties of aliphatic alcohols,
J. Phys. Chem. Ref. Data Suppl., 1973, 1, 2, 1. [all data]