1,8-Paracyclophane
- Formula: C21H26
- Molecular weight: 278.4311
- IUPAC Standard InChIKey: DMCPGMNUZQZGNM-UHFFFAOYSA-N
- CAS Registry Number: 6169-94-4
- Chemical structure:
View 3d structure (requires JavaScript / HTML 5) - Permanent link for this species. Use this link for bookmarking this species for future reference.

Gas phase thermochemistry data

Data compiled by: Hussein Y. Afeefy, Joel F. Liebman, and Stephen E. Stein
Quantity | Value | Units | Method | Reference | Comment |
---|---|---|---|---|---|
ΔfH°gas | 29. ± 9.2 | kJ/mol | Ccb | Shieh, McNally, et al., 1969 |

Condensed phase thermochemistry data

Data compiled by: Hussein Y. Afeefy, Joel F. Liebman, and Stephen E. Stein
Quantity | Value | Units | Method | Reference | Comment |
---|---|---|---|---|---|
ΔfH°solid | -82.0 ± 7.1 | kJ/mol | Ccb | Shieh, McNally, et al., 1969 | |
Quantity | Value | Units | Method | Reference | Comment |
ΔcH°solid | -11898. ± 7.1 | kJ/mol | Ccb | Shieh, McNally, et al., 1969 | Corresponding ΔfHºsolid = -82.0 kJ/mol (simple calculation by NIST; no Washburn corrections) |

Phase change data

Data compiled as indicated in comments:
ALS - Hussein Y. Afeefy, Joel F. Liebman, and Stephen E. Stein
DRB - Donald R. Burgess, Jr.
AC - William E. Acree, Jr., James S. Chickos
Quantity | Value | Units | Method | Reference | Comment |
---|---|---|---|---|---|
ΔsubH° | 111. ± 2. | kJ/mol | V | Shieh, McNally, et al., 1969 | ALS |
ΔsubH° | 111.0 | kJ/mol | N/A | Shieh, McNally, et al., 1969 | DRB |
ΔsubH° | 110.9 ± 2.1 | kJ/mol | N/A | Shieh, McNally, et al., 1969 | See also Pedley and Rylance, 1977.; AC |
Enthalpy of sublimation
ΔsubH (kJ/mol) | Temperature (K) | Reference | Comment |
---|---|---|---|
105. ± 1.3 | 365. | Shieh, McNally, et al., 1969 | Based on data from 354. to 376. K. See also Pedley and Rylance, 1977.; AC |

References

Shieh, McNally, et al., 1969
Shieh, C.; McNally, D.; Boyd, R.H.,
The heats of combustion and strain energies of some cyclophanes,
Tetrahedron, 1969, 3653-3665. [all data]
Pedley and Rylance, 1977
Pedley, J.B.; Rylance, J.,
, Computer Analysed Thermochemical Data: Organic and Organometallic Compounds, University of Sussex, Brighton, 1977. [all data]