2-Octanol, (S)-
- Formula: C8H18O
- Molecular weight: 130.2279
- IUPAC Standard InChIKey: SJWFXCIHNDVPSH-MRVPVSSYSA-N
- CAS Registry Number: 6169-06-8
- Chemical structure:
View 3d structure (requires JavaScript / HTML 5) - Stereoisomers:
- Other names: (S)-(+)-2-Octanol; d-octan-2-ol

Phase change data

Data compiled as indicated in comments:
BS - Robert L. Brown and Stephen E. Stein
TRC - Thermodynamics Research Center, NIST Boulder Laboratories, Chris Muzny director
Quantity | Value | Units | Method | Reference | Comment |
---|---|---|---|---|---|
Tboil | 451. ± 3. | K | AVG | N/A | Average of 23 out of 24 values; Individual data points |
Reduced pressure boiling point
Tboil (K) | Pressure (bar) | Reference | Comment |
---|---|---|---|
359.2 | 0.027 | Weast and Grasselli, 1989 | BS |

References

Weast and Grasselli, 1989
CRC Handbook of Data on Organic Compounds, 2nd Editon, Weast,R.C and Grasselli, J.G., ed(s)., CRC Press, Inc., Boca Raton, FL, 1989, 1. [all data]