4,6-dinitroresorcinol
- Formula: C6H4N2O6
- Molecular weight: 200.1058
- IUPAC Standard InChIKey: MBXIRNHACKAGPA-UHFFFAOYSA-N
- CAS Registry Number: 616-74-0
- Chemical structure:
View 3d structure (requires JavaScript / HTML 5) - Other names: 4,6-Dinitro-1,3-benzenediol

Condensed phase thermochemistry data

Data compiled by: Hussein Y. Afeefy, Joel F. Liebman, and Stephen E. Stein
Quantity | Value | Units | Method | Reference | Comment |
---|---|---|---|---|---|
ΔfH°solid | -443.4 ± 2.7 | kJ/mol | Ccb | Finch and Payne, 1991 | |
ΔfH°solid | -439.5 ± 2.5 | kJ/mol | Ccb | Medard and Thomas, 1954 | Heat of combustion corrected for pressure |
ΔfH°solid | -435.09 | kJ/mol | Ccb | Medard, 1954 | Heat of combustion corrected for pressure |
Quantity | Value | Units | Method | Reference | Comment |
ΔcH°solid | -2489.3 ± 2.6 | kJ/mol | Ccb | Finch and Payne, 1991 | |
ΔcH°solid | -2493. ± 2.5 | kJ/mol | Ccb | Medard and Thomas, 1954 | Heat of combustion corrected for pressure |
ΔcH°solid | -2497.6 | kJ/mol | Ccb | Medard, 1954 | Heat of combustion corrected for pressure |

References

Finch and Payne, 1991
Finch, A.; Payne, J.,
Thermochemistry of nitroresorcinols. Part 2. 2,4-Dinitroresorcinol,
Thermochim. Acta, 1991, 189, 109-114. [all data]
Medard and Thomas, 1954
Medard, L.; Thomas, M.,
Chaleurs de combustion de vingt-quatre substances explosives ou apparentees a des explosifs,
Mem. Poudres, 1954, 36, 97-127. [all data]
Medard, 1954
Medard, L.,
Tables thermochimiques a l'usage des techniciens des substances explosives,
Mem. Artillerie Fr. Sci. Tech. Armement, 1954, 28, 415-492. [all data]