Propanedioic acid, propyl-
- Formula: C6H10O4
- Molecular weight: 146.1412
- IUPAC Standard InChIKey: VQDJODAWOFNASI-UHFFFAOYSA-N
- CAS Registry Number: 616-62-6
- Chemical structure:

Condensed phase thermochemistry data

Data compiled by: Hussein Y. Afeefy, Joel F. Liebman, and Stephen E. Stein
Quantity | Value | Units | Method | Reference | Comment |
---|---|---|---|---|---|
ΔcH°solid | -675.71 | kcal/mol | Ccb | Verkade and Coops, 1933 | At 288 °K; Corresponding ΔfHºsolid = -230.17 kcal/mol (simple calculation by NIST; no Washburn corrections) |

Phase change data

Data compiled by: Thermodynamics Research Center, NIST Boulder Laboratories, Chris Muzny director
Quantity | Value | Units | Method | Reference | Comment |
---|---|---|---|---|---|
Tfus | 369. | K | N/A | Vogel, 1948 | Uncertainty assigned by TRC = 2. K |

References

Verkade and Coops, 1933
Verkade, P.E.; Coops, J., Jr.,
Alternation phenomena VI (calorimetric researches XX): alternations in the properties of n.monoalkylmalonic acids. Some remarks on malkins views concerning the alternation phenonema,
Recl. Trav. Chim. Pays-Bas, 1933, 52, 747-767. [all data]
Vogel, 1948
Vogel, A.I.,
J. Chem. Soc., 1948, 1948, 624-44. [all data]