Phosphonic acid, ethyl-, dimethyl ester
- Formula: C4H11O3P
- Molecular weight: 138.1021
- IUPAC Standard InChIKey: YHQMSHVVGOSZEW-UHFFFAOYSA-N
- CAS Registry Number: 6163-75-3
- Chemical structure:
View 3d structure (requires JavaScript / HTML 5) - Other names: Ethylphosphonic acid, dimethyl ester; Dimethyl ethylphosphonate; Ethylphosphonic acid, Me

Phase change data

Data compiled as indicated in comments:
AC - William E. Acree, Jr., James S. Chickos
Enthalpy of vaporization
ΔvapH (kJ/mol) | Temperature (K) | Reference | Comment |
---|---|---|---|
70.1 | 348. | Stephenson and Malanowski, 1987 | Based on data from 333. to 410. K. See also Frazer, Gerrard, et al., 1955 and Boublik, Fried, et al., 1984.; AC |
Antoine Equation Parameters
log10(P) = A − (B / (T + C))
P = vapor pressure (bar)
T = temperature (K)
View plot Requires a JavaScript / HTML 5 canvas capable browser.
Temperature (K) | A | B | C | Reference | Comment |
---|---|---|---|---|---|
333.4 to 410. | 1.03481 | 245.386 | -266.417 | Kosolapoff, 1955 | Coefficents calculated by NIST from author's data. |

References

Stephenson and Malanowski, 1987
Stephenson, Richard M.; Malanowski, Stanislaw,
Handbook of the Thermodynamics of Organic Compounds, 1987, https://doi.org/10.1007/978-94-009-3173-2
. [all data]
Frazer, Gerrard, et al., 1955
Frazer, M.J.; Gerrard, W.; Coulson, C.A.; Orgel, L.E.; Taylor, W.; Weiss, J.; Taylor, W.I.; Uyeo, S.; Yajima, H.; Kosolapoff, Gennady M.; McQuillin, F.J.; Stewart, J.; Henbest, H.B.; Owen, T.C.; Nayler, P.; Whiting, M.C.; Cadogan, J.I.G.,
Notes,
J. Chem. Soc., 1955, 2959, https://doi.org/10.1039/jr9550002959
. [all data]
Boublik, Fried, et al., 1984
Boublik, T.; Fried, V.; Hala, E.,
The Vapour Pressures of Pure Substances: Selected Values of the Temperature Dependence of the Vapour Pressures of Some Pure Substances in the Normal and Low Pressure Region, 2nd ed., Elsevier, New York, 1984, 972. [all data]
Kosolapoff, 1955
Kosolapoff, G.M.,
Vapour Pressures and Densities of Some Lower Alkylphosphonates,
J. Chem. Soc., 1955, 2964-2965. [all data]