1-Propanol, 2,3-dichloro-

Condensed phase thermochemistry data

Data compiled by: Hussein Y. Afeefy, Joel F. Liebman, and Stephen E. Stein

Quantity Value Units Method Reference Comment
Δfliquid-381. ± 2.kJ/molCcrBjellerup and Smith, 1954At 293 K
Quantity Value Units Method Reference Comment
Δcliquid-1704. ± 1.kJ/molCcrBjellerup and Smith, 1954At 293 K
Δcliquid-1722.96kJ/molCcbSmith and Schjdnberg, 1931Not corrected for CODATA value of ΔfH; Only two runs

References

Bjellerup and Smith, 1954
Bjellerup, L.; Smith, L., Heats of combustion of some organic chloro-compounds, Kgl. Fysiograph. Sallskap. Lund Forh., 1954, 24, 1-13. [all data]

Smith and Schjdnberg, 1931
Smith, L.; Schjdnberg, E., Uber die Verbrennung von chlorhaltigen Substanzen in Berthelots Bombe, Svensk Kemisk Tidskrift, 1931, 213-226. [all data]