Butane, 1,2-dichloro-
- Formula: C4H8Cl2
- Molecular weight: 127.012
- IUPAC Standard InChIKey: PQBOTZNYFQWRHU-UHFFFAOYSA-N
- CAS Registry Number: 616-21-7
- Chemical structure:
View 3d structure (requires JavaScript / HTML 5) - Other names: 1,2-Dichlorobutane; 1,2-Butylene chloride

Condensed phase thermochemistry data

Data compiled as indicated in comments:
ALS - Hussein Y. Afeefy, Joel F. Liebman, and Stephen E. Stein
DH - Eugene S. Domalski and Elizabeth D. Hearing
Quantity | Value | Units | Method | Reference | Comment |
---|---|---|---|---|---|
ΔfH°liquid | -231.4 ± 1.7 | kJ/mol | Ccr | He, An, et al., 1992 | ALS |
ΔfH°liquid | -232.2 | kJ/mol | Eqk | Cherkasova, Rozhnov, et al., 1974 | ALS |
Quantity | Value | Units | Method | Reference | Comment |
ΔcH°liquid | -2533.3 ± 1.6 | kJ/mol | Ccr | He, An, et al., 1992 | ALS |
Constant pressure heat capacity of liquid
Cp,liquid (J/mol*K) | Temperature (K) | Reference | Comment |
---|---|---|---|
195.6 | 298.15 | He, An, et al., 1992 | DH |

Phase change data

Data compiled as indicated in comments:
BS - Robert L. Brown and Stephen E. Stein
TRC - Thermodynamics Research Center, NIST Boulder Laboratories, Chris Muzny director
AC - William E. Acree, Jr., James S. Chickos
ALS - Hussein Y. Afeefy, Joel F. Liebman, and Stephen E. Stein
Quantity | Value | Units | Method | Reference | Comment |
---|---|---|---|---|---|
Tboil | 396. ± 6. | K | AVG | N/A | Average of 8 values; Individual data points |
Quantity | Value | Units | Method | Reference | Comment |
ΔvapH° | 40.1 ± 0.5 | kJ/mol | AVG | N/A | Average of 6 values; Individual data points |
Enthalpy of vaporization
ΔvapH (kJ/mol) | Temperature (K) | Method | Reference | Comment |
---|---|---|---|---|
33.9 | 397.2 | N/A | Majer and Svoboda, 1985 | |
39.0 | 327. | A | Stephenson and Malanowski, 1987 | Based on data from 312. to 394. K.; AC |
38.1 | 264. | A | Stephenson and Malanowski, 1987 | Based on data from 249. to 397. K. See also Stull, 1947.; AC |
Antoine Equation Parameters
log10(P) = A − (B / (T + C))
P = vapor pressure (bar)
T = temperature (K)
View plot Requires a JavaScript / HTML 5 canvas capable browser.
Temperature (K) | A | B | C | Reference | Comment |
---|---|---|---|---|---|
249.6 to 396.7 | 4.0146 | 1411.035 | -44.846 | Stull, 1947 | Coefficents calculated by NIST from author's data. |

Gas phase thermochemistry data

Data compiled by: Hussein Y. Afeefy, Joel F. Liebman, and Stephen E. Stein
Quantity | Value | Units | Method | Reference | Comment |
---|---|---|---|---|---|
ΔfH°gas | -45.70 ± 0.40 | kcal/mol | Ccr | He, An, et al., 1992 |

Reaction thermochemistry data

Data compiled by: Hussein Y. Afeefy, Joel F. Liebman, and Stephen E. Stein
Individual Reactions
By formula: C4H8Cl2 = C4H8Cl2
Quantity | Value | Units | Method | Reference | Comment |
---|---|---|---|---|---|
ΔrH° | -1.71 ± 0.30 | kcal/mol | Eqk | Cherkasova, Rozhnov, et al., 1974 | gas phase |
By formula: C4H8Cl2 = C4H8Cl2
Quantity | Value | Units | Method | Reference | Comment |
---|---|---|---|---|---|
ΔrH° | -0.65 ± 0.16 | kcal/mol | Eqk | Cherkasova, Rozhnov, et al., 1974 | gas phase |

Normal alkane RI, non-polar column, isothermal

View large format table.

Column type Active phase Temperature (C) I Reference Comment
CapillaryApiezon L130.801.Arruda, Junkes, et al., 2008

Normal alkane RI, non-polar column, custom temperature program

View large format table.

Column type Active phase I Reference Comment
CapillaryPolydimethyl siloxanes785.Zenkevich, 2003Program: not specified
CapillaryMethyl Silicone785.Zenkevich and Marinichev, 2001Program: not specified
CapillaryPolydimethyl siloxanes785.Zenkevich, Chupalov, et al., 1996Program: not specified
CapillaryOV-1, SE-30, Methyl silicone, SP-2100, OV-101, DB-1, etc.785.Waggott and Davies, 1984Hydrogen; Column length: 50. m; Column diameter: 0.32 mm; Program: not specified

References

He, An, et al., 1992
He, J.; An, X.; Hu, R.,
Measurements of enthalpies of formation of 2-chlorobutane and 1,2-dichlorobutane in gaseous state,
Acta Chim. Sin., 1992, 50, 961-966. [all data]
Cherkasova, Rozhnov, et al., 1974
Cherkasova, R.I.; Rozhnov, A.M.; Nesterova, T.N.,
Equilibrium of isomerization of 1,2-, 1,3-, and 1,4-dichlorobutanes,
Russ. J. Phys. Chem. (Engl. Transl.), 1974, 48, 143. [all data]
Majer and Svoboda, 1985
Majer, V.; Svoboda, V.,
Enthalpies of Vaporization of Organic Compounds: A Critical Review and Data Compilation, Blackwell Scientific Publications, Oxford, 1985, 300. [all data]
Stephenson and Malanowski, 1987
Stephenson, Richard M.; Malanowski, Stanislaw,
Handbook of the Thermodynamics of Organic Compounds, 1987, https://doi.org/10.1007/978-94-009-3173-2
. [all data]
Stull, 1947
Stull, Daniel R.,
Vapor Pressure of Pure Substances. Organic and Inorganic Compounds,
Ind. Eng. Chem., 1947, 39, 4, 517-540, https://doi.org/10.1021/ie50448a022
. [all data]