Propane, 1,3-dichloro-2-methyl-
- Formula: C4H8Cl2
- Molecular weight: 127.012
- IUPAC Standard InChIKey: VENSUTAUIFXSRD-UHFFFAOYSA-N
- CAS Registry Number: 616-19-3
- Chemical structure:
View 3d structure (requires JavaScript / HTML 5) - Other names: 1,3-Dichloro-2-methylpropane; 1,3-Dichloroisobutane

Phase change data

Data compiled as indicated in comments:
BS - Robert L. Brown and Stephen E. Stein
AC - William E. Acree, Jr., James S. Chickos
Reduced pressure boiling point
Tboil (K) | Pressure (bar) | Reference | Comment |
---|---|---|---|
318.2 | 0.013 | Weast and Grasselli, 1989 | BS |
Enthalpy of vaporization
ΔvapH (kJ/mol) | Temperature (K) | Method | Reference | Comment |
---|---|---|---|---|
45.1 | 285. | A | Stephenson and Malanowski, 1987 | Based on data from 270. to 408. K. See also Stull, 1947.; AC |
Antoine Equation Parameters
log10(P) = A − (B / (T + C))
P = vapor pressure (bar)
T = temperature (K)
View plot Requires a JavaScript / HTML 5 canvas capable browser.
Temperature (K) | A | B | C | Reference | Comment |
---|---|---|---|---|---|
270. to 408. | 5.19732 | 2008.379 | -21.336 | Stull, 1947 | Coefficents calculated by NIST from author's data. |

Kovats' RI, non-polar column, isothermal

Column type | Active phase | Temperature (C) | I | Reference | Comment |
---|---|---|---|---|---|
Packed | Squalane | 110. | 810. | Engewald, Mai, et al., 1976 | N2, Chromosorb W (60-80 mesh); Column length: 3. m |

Normal alkane RI, non-polar column, custom temperature program

Column type | Active phase | I | Reference | Comment |
---|---|---|---|---|
Capillary | Polydimethyl siloxanes | 820. | Zenkevich, 2003 | Program: not specified |
Capillary | Methyl Silicone | 820. | Zenkevich and Marinichev, 2001 | Program: not specified |

References

Weast and Grasselli, 1989
CRC Handbook of Data on Organic Compounds, 2nd Editon, Weast,R.C and Grasselli, J.G., ed(s)., CRC Press, Inc., Boca Raton, FL, 1989, 1. [all data]
Stephenson and Malanowski, 1987
Stephenson, Richard M.; Malanowski, Stanislaw,
Handbook of the Thermodynamics of Organic Compounds, 1987, https://doi.org/10.1007/978-94-009-3173-2
. [all data]
Stull, 1947
Stull, Daniel R.,
Vapor Pressure of Pure Substances. Organic and Inorganic Compounds,
Ind. Eng. Chem., 1947, 39, 4, 517-540, https://doi.org/10.1021/ie50448a022
. [all data]
Engewald, Mai, et al., 1976
Engewald, V.W.; Mai, H.; Mühlstädt, M.,
Gaschromatographische Charakterisierung von Chlorierungs-produkten des Isobutens,
J. Prakt. Chem., 1976, 318, 4, 565-574, https://doi.org/10.1002/prac.19763180405
. [all data]
Zenkevich, 2003
Zenkevich, I.G.,
Criteria for Evaluation of Elution Order of Isomeric Organic Compounds,
Zh. Phys. Khim. (Rus.), 2003, 77, 1, 92-98. [all data]
Zenkevich and Marinichev, 2001
Zenkevich, I.G.; Marinichev, A.N.,
Comparison of Topological and Dynamics Molecular Characteristics for Precalculation of Chromatographic Retention Parameters of Organic Compounds (in Russian),
Zh. Struct. Khim., 2001, 42, 5, 893-902. [all data]