Phenol, 3-ethyl-4-methyl-
- Formula: C9H12O
- Molecular weight: 136.1910
- IUPAC Standard InChIKey: BTRPJOHXPQOVLS-UHFFFAOYSA-N
- CAS Registry Number: 6161-67-7
- Chemical structure:
View 3d structure (requires JavaScript / HTML 5) - Other names: 3-ethyl-p-cresol; 3-ethyl-4-methylphenol

Phase change data

Data compiled by: Thermodynamics Research Center, NIST Boulder Laboratories, Chris Muzny director
Quantity | Value | Units | Method | Reference | Comment |
---|---|---|---|---|---|
Tboil | 507.65 | K | N/A | Karr, Estep, et al., 1961 | Uncertainty assigned by TRC = 3. K |
Tboil | 507.65 | K | N/A | Karr, 1957 | Uncertainty assigned by TRC = 3. K |
Tboil | 513.15 | K | N/A | White, 1954 | Uncertainty assigned by TRC = 4. K |
Quantity | Value | Units | Method | Reference | Comment |
Tfus | 306.15 | K | N/A | Karr, 1957 | Uncertainty assigned by TRC = 3. K |
Tfus | 306.15 | K | N/A | White, 1954 | Uncertainty assigned by TRC = 3. K |

References

Karr, Estep, et al., 1961
Karr, C.; Estep, P.A.; Chang, T.-C.L.; Comberiati, H.R.,
, U. S. Bur. Mines, Bull. 591, 1961. [all data]
Karr, 1957
Karr, C.,
, U. S. Bur. Mines, Inform. Circ. IC 7802, 1957. [all data]
White, 1954
White, E.N.,
5th Tar Conf. Coal Tar Res. Assoc. Rept. 0124, 1954, England, 1954. [all data]