Butane, 1-chloro-2-methyl-
- Formula: C5H11Cl
- Molecular weight: 106.594
- IUPAC Standard InChIKey: IWAKWOFEHSYKSI-UHFFFAOYSA-N
- CAS Registry Number: 616-13-7
- Chemical structure:
View 3d structure (requires JavaScript / HTML 5) - Stereoisomers:
- Other names: 1-Chloro-2-methylbutane; (dl) 1-chloro-2-methylbutane

Phase change data

Data compiled as indicated in comments:
TRC - Thermodynamics Research Center, NIST Boulder Laboratories, Chris Muzny director
AC - William E. Acree, Jr., James S. Chickos
Quantity | Value | Units | Method | Reference | Comment |
---|---|---|---|---|---|
Tboil | 373.05 | K | N/A | Hass, McBee, et al., 1935 | Uncertainty assigned by TRC = 0.6 K; TRC |
Tboil | 373.15 | K | N/A | Kohlrausch and Koppl, 1935 | Uncertainty assigned by TRC = 0.6 K; TRC |
Tboil | 370.35 | K | N/A | Underwood and Gale, 1934 | Uncertainty assigned by TRC = 3. K; TRC |
Enthalpy of vaporization
ΔvapH (kJ/mol) | Temperature (K) | Method | Reference | Comment |
---|---|---|---|---|
35.4 | 315. | A | Stephenson and Malanowski, 1987 | Based on data from 300. to 374. K. See also Dykyj, 1972.; AC |

Kovats' RI, polar column, isothermal

Column type | Active phase | Temperature (C) | I | Reference | Comment |
---|---|---|---|---|---|
Packed | Carbowax 20M | 100. | 898. | Castello and D'Amato, 1986 | He, Chromosorb W AW DMC; Column length: 3. m |
Packed | Carbowax 20M | 125. | 900. | Castello and D'Amato, 1986 | He, Chromosorb W AW DMC; Column length: 3. m |
Packed | Carbowax 20M | 75. | 891. | Castello and D'Amato, 1986 | He, Chromosorb W AW DMC; Column length: 3. m |

Normal alkane RI, non-polar column, isothermal

Column type | Active phase | Temperature (C) | I | Reference | Comment |
---|---|---|---|---|---|
Capillary | Apiezon L | 130. | 718. | Arruda, Junkes, et al., 2008 | |
Capillary | Squalane | 30. | 696. | Tourres, 1968 | Nitrogen; Column length: 50. m; Column diameter: 0.25 mm |
Capillary | Squalane | 50. | 699. | Tourres, 1968 | Nitrogen; Column length: 50. m; Column diameter: 0.25 mm |

References

Hass, McBee, et al., 1935
Hass, H.B.; McBee, E.T.; Weber, P.,
Ind. Eng. Chem., 1935, 27, 1190. [all data]
Kohlrausch and Koppl, 1935
Kohlrausch; Koppl, F.,
Monatsh. Chem., 1935, 65, 195. [all data]
Underwood and Gale, 1934
Underwood, H.W.; Gale, J.C.,
J. Am. Chem. Soc., 1934, 56, 2117. [all data]
Stephenson and Malanowski, 1987
Stephenson, Richard M.; Malanowski, Stanislaw,
Handbook of the Thermodynamics of Organic Compounds, 1987, https://doi.org/10.1007/978-94-009-3173-2
. [all data]
Dykyj, 1972
Dykyj, J.,
Petrochemia, 1972, 12, 1, 13. [all data]
Castello and D'Amato, 1986
Castello, G.; D'Amato, G.,
Gas chromatographic separation and identification of linear and branched-chain alkyl chlorides,
J. Chromatogr., 1986, 354, 65-74, https://doi.org/10.1016/S0021-9673(01)87011-4
. [all data]
Arruda, Junkes, et al., 2008
Arruda, A.C.S.; Junkes, B. da.S.; Souza, E.S.; Yunes, R.A.; Heizen, V.E.F.,
Semi-Emlirical Topological Index to Predict Properties of Halogenated Aliphatic Compounds,
J. Chemometrics, 2008, 22, 3-4, 186-194, https://doi.org/10.1002/cem.1121
. [all data]
Tourres, 1968
Tourres, D.A.,
Separation of mono- and dichloro-methyl butanes and of monochloro-methyl butenes by preparative gas chromatography,
Chromatographia, 1968, 1, 11-12, 437-442, https://doi.org/10.1007/BF02255759
. [all data]